program: Orca
programVersion: 5.0.2
elementType: Br F F O O O C C C C C C C C C C C C C C C C C C C C C C C C H H H H H H H H H H H H H H H H H H H H H H H
charge: 0
multiplicity: 1
keywords: wb97x-d3
keywords: def2-TZVPP
keywords: def2/J RIJCOSX
keywords: DEFGRID2
keywords: scfconv7
keywords: smallprint printgap noloewdin
keywords: NOSOSCF
formula: C24H23BrF2O3
InChI: InChI=1/C24H23BrF2O3/c1-23(2,19-11-13-21(14-12-19)30-24(25,26)27)17-28-16-18-7-6-10-22(15-18)29-20-8-4-3-5-9-20/h3-15H,16-17H2,1-2H3
53 atoms
Br 3.811544 -2.244097 1.008755
F  1.407961 -3.163792 1.74893
F  1.704429 -1.082597 2.181579
O  -3.959343 1.292367 -1.185069
O  1.377838 -1.706217 0.070805
O  1.066642 1.573598 0.350525
C  -4.166473 -1.111605 -1.170282
C  -4.633356 0.217893 -0.568953
C  -2.690784 -1.295224 -0.836895
C  -4.434982 -1.120986 -2.675363
C  -4.999803 -2.230231 -0.534902
C  -1.68531 -1.243561 -1.797416
C  -2.291863 -1.480484 0.485826
C  -3.729868 2.402632 -0.346126
C  -0.34788 -1.387237 -1.457853
C  -0.96233 -1.622903 0.853212
C  0.007627 -1.580349 -0.1357
C  -2.551402 2.184659 0.568013
C  -1.28742 2.003478 0.009605
C  -2.707218 2.123376 1.947064
C  -0.191948 1.794139 0.832943
C  -1.605311 1.896357 2.762914
C  -0.344453 1.737912 2.21405
C  1.906411 -2.025864 1.252373
C  1.513301 2.200577 -0.778357
C  1.242751 3.537809 -1.046116
C  2.323263 1.460848 -1.629707
C  1.780641 4.123657 -2.182931
C  2.863449 2.063676 -2.756332
C  2.589906 3.393547 -3.043178
H  -5.718083 0.324749 -0.71233
H  -4.458911 0.204533 0.513968
H  -4.134205 -2.069033 -3.125264
H  -5.504196 -0.998746 -2.859002
H  -3.922354 -0.322221 -3.210988
H  -4.678014 -3.208262 -0.895671
H  -6.054411 -2.113889 -0.792842
H  -4.933025 -2.239958 0.553734
H  -1.925069 -1.091941 -2.840643
H  -3.028605 -1.510402 1.278385
H  -3.534931 3.251112 -1.006573
H  -4.621551 2.654019 0.241366
H  0.415381 -1.347123 -2.224849
H  -0.736926 -1.753277 1.90129
H  -1.169106 2.030821 -1.067418
H  -3.688628 2.256243 2.386001
H  -1.72813 1.847752 3.837277
H  0.517754 1.572262 2.847403
H  0.623945 4.123598 -0.378058
H  2.53865 0.424162 -1.405098
H  1.566962 5.164131 -2.391554
H  3.498043 1.484067 -3.414377
H  3.006898 3.858792 -3.926529
elementType: Br F O C H
totalener: -3928.11237977 hartree
nucrepener: 3645.34961200 hartree
electener: -7573.46199178 hartree
twoeener: 5115.35402356 hartree
cpcmener: -0.02303435 hartree
kineticenergy: 3918.79134447 hartree
xcener: -198.383088055945 hartree
chargesum: 0.0000000
charge: -0.041980 -0.159754 -0.158957 -0.378420 -0.258412 -0.323816 0.399274 -0.088727 -0.053498 -0.367350 -0.337589 -0.163973 -0.279581 0.063045 -0.220449 -0.168257 0.291650 0.054047 -0.257164 -0.217424 0.322141 -0.101025 -0.288605 0.419569 0.328392 -0.206776 -0.276668 -0.144907 -0.116386 -0.189910 0.107269 0.102724 0.112050 0.102696 0.095621 0.108476 0.102823 0.101333 0.140939 0.138823 0.107873 0.098932 0.142482 0.127564 0.136481 0.140255 0.155932 0.139799 0.152181 0.136816 0.157444 0.156520 0.156474
qa: -0.0420 -0.1598 -0.1590 -0.3784 -0.2584 -0.3238 0.3993 -0.0887 -0.0535 -0.3673 -0.3376 -0.1640 -0.2796 0.0630 -0.2204 -0.1683 0.2917 0.0540 -0.2572 -0.2174 0.3221 -0.1010 -0.2886 0.4196 0.3284 -0.2068 -0.2767 -0.1449 -0.1164 -0.1899 0.1073 0.1027 0.1120 0.1027 0.0956 0.1085 0.1028 0.1013 0.1409 0.1388 0.1079 0.0989 0.1425 0.1276 0.1365 0.1403 0.1559 0.1398 0.1522 0.1368 0.1574 0.1565 0.1565
va: 1.1864 1.1385 1.1327 1.9275 2.1400 2.0409 3.5424 3.9865 3.6305 3.9190 3.9189 3.9441 4.0839 3.9041 3.9854 3.9494 3.6273 3.5760 3.9267 3.9034 3.5559 3.8741 4.0040 4.5534 3.6648 3.9323 3.9731 3.8966 3.9032 3.9150 1.0034 0.9859 0.9995 1.0053 1.0130 1.0022 1.0043 1.0020 0.9986 1.0068 0.9909 0.9942 1.0058 1.0331 1.0178 1.0046 0.9885 1.0156 0.9997 1.0170 0.9906 0.9905 0.9908
dispcorr: -0.034856455 hartree
energy: -3928.147236230078
dipole: -82.98005 81.33890 -1.64115 37.34691 -36.80808 0.53884 -28.80451 28.71359 -0.09093
magnitude: 1.72973 au
magnitude: 4.39663 debye
