program: Orca
programVersion: 5.0.2
elementType: Br F F O O O C C C C C C C C C C C C C C C C C C C C C C C C H H H H H H H H H H H H H H H H H H H H H H H
charge: 0
multiplicity: 1
keywords: wb97x-d3
keywords: def2-TZVPP
keywords: def2/J RIJCOSX
keywords: DEFGRID2
keywords: scfconv7
keywords: smallprint printgap noloewdin
keywords: NOSOSCF
formula: C24H23BrF2O3
InChI: InChI=1/C24H23BrF2O3/c1-23(2,19-11-13-21(14-12-19)30-24(25,26)27)17-28-16-18-7-6-10-22(15-18)29-20-8-4-3-5-9-20/h3-15H,16-17H2,1-2H3
53 atoms
Br 1.638087 -4.01646 0.73167
F  2.653889 -1.610882 0.112913
F  2.945042 -3.076788 -1.424416
O  -4.386613 0.828714 -0.81393
O  1.003213 -2.191302 -1.261524
O  0.429334 3.351269 0.686685
C  -4.147516 -0.927094 0.826946
C  -4.357906 0.569755 0.571875
C  -2.772749 -1.312761 0.296083
C  -5.276112 -1.725618 0.17484
C  -4.216038 -1.158905 2.340613
C  -2.595402 -2.139453 -0.808531
C  -1.624935 -0.787787 0.893619
C  -3.857493 2.080316 -1.197245
C  -1.329401 -2.443224 -1.290951
C  -0.353513 -1.064044 0.420862
C  -0.219657 -1.902093 -0.674539
C  -2.351674 2.058539 -1.238154
C  -1.604004 2.748596 -0.295677
C  -1.696395 1.295465 -2.2048
C  -0.213218 2.677254 -0.310403
C  -0.314433 1.237888 -2.218019
C  0.441454 1.92343 -1.273541
C  2.056325 -2.60675 -0.556173
C  1.77247 3.608084 0.576272
C  2.240748 4.508659 -0.371132
C  2.639854 2.99348 1.465253
C  3.59724 4.792692 -0.422056
C  3.995214 3.291695 1.409343
C  4.47787 4.187416 0.465955
H  -5.303888 0.888914 1.032088
H  -3.560674 1.135117 1.069147
H  -6.234779 -1.41644 0.594579
H  -5.335893 -1.586737 -0.904049
H  -5.167958 -2.794582 0.366012
H  -5.207616 -0.906713 2.721169
H  -3.494554 -0.555814 2.893288
H  -4.026303 -2.205614 2.582751
H  -3.445503 -2.570418 -1.31873
H  -1.708467 -0.123799 1.744414
H  -4.253363 2.286359 -2.194184
H  -4.210604 2.883261 -0.539144
H  -1.213069 -3.090344 -2.151061
H  0.498758 -0.604492 0.9015
H  -2.098263 3.346403 0.462108
H  -2.267668 0.750447 -2.946417
H  0.195306 0.646025 -2.967575
H  1.520971 1.85067 -1.296672
H  1.552902 4.986415 -1.058276
H  2.257824 2.294332 2.198894
H  3.965729 5.495988 -1.157633
H  4.673787 2.816506 2.106163
H  5.534611 4.416486 0.423894
elementType: Br F O C H
totalener: -3928.11399169 hartree
nucrepener: 3548.00720282 hartree
electener: -7476.12119450 hartree
twoeener: 5017.44562441 hartree
cpcmener: -0.02360588 hartree
kineticenergy: 3918.79344414 hartree
xcener: -198.382666843232 hartree
chargesum: -0.0000000
charge: -0.075019 -0.159858 -0.150029 -0.377154 -0.268353 -0.328869 0.399283 -0.088942 -0.034388 -0.365100 -0.338390 -0.190151 -0.245335 0.059350 -0.141349 -0.126801 0.130908 0.084358 -0.278364 -0.282968 0.307719 -0.123600 -0.208016 0.421591 0.232098 -0.164501 -0.201252 -0.156093 -0.147617 -0.155500 0.107845 0.103788 0.103264 0.095649 0.112132 0.103148 0.101925 0.108359 0.140006 0.141507 0.107712 0.099204 0.146304 0.154996 0.128495 0.138069 0.154388 0.147603 0.156023 0.146567 0.158530 0.158125 0.158702
qa: -0.0750 -0.1599 -0.1500 -0.3772 -0.2684 -0.3289 0.3993 -0.0889 -0.0344 -0.3651 -0.3384 -0.1902 -0.2453 0.0594 -0.1413 -0.1268 0.1309 0.0844 -0.2784 -0.2830 0.3077 -0.1236 -0.2080 0.4216 0.2321 -0.1645 -0.2013 -0.1561 -0.1476 -0.1555 0.1078 0.1038 0.1033 0.0956 0.1121 0.1031 0.1019 0.1084 0.1400 0.1415 0.1077 0.0992 0.1463 0.1550 0.1285 0.1381 0.1544 0.1476 0.1560 0.1466 0.1585 0.1581 0.1587
va: 1.1809 1.1278 1.1444 1.9281 2.0815 2.0673 3.5445 3.9767 3.5760 3.9176 3.9216 3.9718 4.0470 3.9002 4.0152 3.9013 3.7310 3.5222 3.9840 3.9499 3.6766 3.8570 3.8577 4.5798 3.7287 3.9348 3.9854 3.8933 3.8941 3.8819 1.0041 0.9863 1.0054 1.0131 0.9991 1.0043 1.0018 1.0021 0.9988 1.0032 0.9905 0.9943 1.0045 1.0048 1.0208 1.0099 0.9928 1.0050 0.9970 1.0046 0.9904 0.9899 0.9898
dispcorr: -0.032351685 hartree
energy: -3928.146343373905
dipole: -54.66407 53.97330 -0.69077 60.62795 -59.86428 0.76367 -2.59846 3.01512 0.41666
magnitude: 1.11084 au
magnitude: 2.82354 debye
