program: Orca
programVersion: 5.0.2
elementType: Br F F O O O C C C C C C C C C C C C C C C C C C C C C C C C H H H H H H H H H H H H H H H H H H H H H H H
charge: 0
multiplicity: 1
keywords: wb97x-d3
keywords: def2-TZVPP
keywords: def2/J RIJCOSX
keywords: DEFGRID2
keywords: scfconv7
keywords: smallprint printgap noloewdin
keywords: NOSOSCF
formula: C24H23BrF2O3
InChI: InChI=1/C24H23BrF2O3/c1-23(2,19-11-13-21(14-12-19)30-24(25,26)27)17-28-16-18-7-6-10-22(15-18)29-20-8-4-3-5-9-20/h3-15H,16-17H2,1-2H3
53 atoms
Br 1.911318 -3.523404 1.00644
F  3.534217 -1.420874 0.574207
F  2.523481 -2.117879 -1.190424
O  -4.307909 1.151347 -0.906657
O  1.483112 -0.869259 0.326255
O  0.783666 1.949202 -0.839004
C  -4.135176 -1.229786 -0.532279
C  -4.715324 0.109421 -0.05975
C  -2.623252 -1.196948 -0.349897
C  -4.552269 -1.477295 -1.981729
C  -4.744085 -2.340386 0.333466
C  -2.085714 -1.097994 0.933505
C  -1.730471 -1.218402 -1.414728
C  -3.998038 2.36268 -0.266116
C  -0.723509 -1.025261 1.148256
C  -0.35691 -1.141355 -1.222386
C  0.13416 -1.050336 0.064312
C  -2.617948 2.357974 0.339936
C  -1.516567 2.184643 -0.491277
C  -2.419786 2.51825 1.703959
C  -0.23677 2.173316 0.034546
C  -1.133479 2.496744 2.228238
C  -0.03598 2.317609 1.404875
C  2.365683 -1.844624 0.114146
C  1.988506 2.569721 -0.693103
C  3.114607 1.85024 -1.068952
C  2.108263 3.883541 -0.255738
C  4.36294 2.446617 -1.001868
C  3.365707 4.463881 -0.184991
C  4.497647 3.75219 -0.552968
H  -5.813405 0.04242 -0.055149
H  -4.404567 0.288646 0.977682
H  -4.176858 -2.436008 -2.343347
H  -5.640837 -1.506601 -2.053704
H  -4.206207 -0.696819 -2.657432
H  -5.826852 -2.381258 0.20059
H  -4.551853 -2.199669 1.397567
H  -4.337858 -3.312548 0.054133
H  -2.736285 -1.059679 1.797586
H  -2.095444 -1.277744 -2.430207
H  -4.060862 3.136558 -1.035115
H  -4.74296 2.618859 0.499585
H  -0.3266 -0.930633 2.149462
H  0.304569 -1.11844 -2.076331
H  -1.650147 2.049066 -1.55729
H  -3.26945 2.661895 2.360719
H  -0.982974 2.610386 3.29389
H  0.962108 2.284733 1.821728
H  3.006386 0.833886 -1.420324
H  1.231173 4.452912 0.023275
H  5.236624 1.880179 -1.295959
H  3.456097 5.486612 0.156564
H  5.474565 4.212321 -0.495105
totalener: -3928.08902987 hartree
nucrepener: 3652.03997899 hartree
electener: -7580.12900886 hartree
twoeener: 5120.54967248 hartree
kineticenergy: 3918.86138963 hartree
xcener: -198.395896403780 hartree
chargesum: 0.0000000
charge: -0.070835 -0.144138 -0.165805 -0.321662 -0.266479 -0.296229 0.322752 -0.064473 -0.006501 -0.351736 -0.302140 -0.169424 -0.179720 0.028537 -0.142522 -0.044984 0.098541 0.101020 -0.309842 -0.189945 0.312904 -0.082462 -0.205680 0.440154 0.303664 -0.217580 -0.199686 -0.098639 -0.114281 -0.147804 0.094424 0.079969 0.103289 0.090335 0.103431 0.092534 0.090870 0.107543 0.102384 0.114398 0.096150 0.082637 0.123596 0.111152 0.111193 0.108074 0.126017 0.134469 0.109614 0.129887 0.124957 0.124840 0.123233
qa: -0.0708 -0.1441 -0.1658 -0.3217 -0.2665 -0.2962 0.3228 -0.0645 -0.0065 -0.3517 -0.3021 -0.1694 -0.1797 0.0285 -0.1425 -0.0450 0.0985 0.1010 -0.3098 -0.1899 0.3129 -0.0825 -0.2057 0.4402 0.3037 -0.2176 -0.1997 -0.0986 -0.1143 -0.1478 0.0944 0.0800 0.1033 0.0903 0.1034 0.0925 0.0909 0.1075 0.1024 0.1144 0.0962 0.0826 0.1236 0.1112 0.1112 0.1081 0.1260 0.1345 0.1096 0.1299 0.1250 0.1248 0.1232
va: 1.1911 1.1586 1.1283 1.9812 2.0700 2.0690 3.6851 4.0006 3.6152 3.9299 3.9218 4.0259 3.9914 3.9411 4.0179 4.0273 3.8161 3.5274 4.0982 3.9524 3.6703 3.9092 3.9483 4.5558 3.7605 4.0408 3.9658 3.9669 3.9441 3.9672 1.0045 0.9912 1.0009 1.0102 1.0133 1.0082 1.0052 1.0049 1.0128 1.0086 0.9927 0.9931 1.0140 1.0231 1.0326 1.0124 0.9992 1.0100 1.0360 1.0070 1.0005 1.0001 1.0009
dispcorr: -0.035213016 hartree
energy: -3928.124242882705
dipole: -60.27987 59.19384 -1.08603 51.46036 -51.00007 0.46029 -11.79963 12.32413 0.52451
magnitude: 1.29091 au
magnitude: 3.28122 debye
