program: Orca
programVersion: 5.0.2
elementType: Br F F O O O C C C C C C C C C C C C C C C C C C C C C C C C H H H H H H H H H H H H H H H H H H H H H H H
charge: 0
multiplicity: 1
keywords: wb97x-d3
keywords: def2-TZVPP
keywords: def2/J RIJCOSX
keywords: DEFGRID2
keywords: scfconv7
keywords: smallprint printgap noloewdin
keywords: NOSOSCF
formula: C24H23BrF2O3
InChI: InChI=1/C24H23BrF2O3/c1-23(2,19-11-13-21(14-12-19)30-24(25,26)27)17-28-16-18-7-6-10-22(15-18)29-20-8-4-3-5-9-20/h3-15H,16-17H2,1-2H3
53 atoms
Br 2.791389 -2.273713 -1.572419
F  2.288461 -3.265141 0.85774
F  3.75374 -1.68412 0.861385
O  -4.373128 0.386106 0.869423
O  1.691145 -1.130501 0.715571
O  0.288379 2.224536 1.404544
C  -3.866503 -1.523724 -0.487747
C  -4.42735 -0.098509 -0.444563
C  -2.380179 -1.473724 -0.154633
C  -4.062273 -2.073043 -1.907014
C  -4.659135 -2.408576 0.474594
C  -1.838136 -2.061503 0.982502
C  -1.507267 -0.788114 -0.999207
C  -4.517489 1.773088 0.978809
C  -0.481105 -1.981275 1.267936
C  -0.15475 -0.692086 -0.731492
C  0.351836 -1.29756 0.404443
C  -3.247423 2.534626 0.685654
C  -2.020473 2.014567 1.082228
C  -3.293259 3.784131 0.080478
C  -0.862938 2.755284 0.905284
C  -2.128996 4.518489 -0.09551
C  -0.907613 4.017222 0.32296
C  2.584608 -2.057019 0.36362
C  1.440963 2.179332 0.684085
C  1.499847 2.295438 -0.699204
C  2.5987 1.93681 1.41357
C  2.721778 2.150224 -1.342241
C  3.807009 1.788061 0.757669
C  3.878163 1.892773 -0.624383
H  -3.857846 0.544388 -1.130479
H  -5.467939 -0.106363 -0.805795
H  -5.123876 -2.131891 -2.15458
H  -3.583226 -1.45583 -2.667626
H  -3.645185 -3.076722 -1.990587
H  -4.309021 -3.441565 0.439421
H  -5.712608 -2.413125 0.189698
H  -4.605201 -2.062768 1.50557
H  -2.472226 -2.59257 1.677958
H  -1.882292 -0.298298 -1.888633
H  -5.331796 2.148168 0.341645
H  -4.817081 1.968928 2.012361
H  -0.087746 -2.431015 2.169502
H  0.499926 -0.138288 -1.388622
H  -1.955864 1.035941 1.541298
H  -4.241812 4.192252 -0.247628
H  -2.171966 5.496192 -0.557217
H  -0.004118 4.601024 0.202738
H  0.605668 2.482064 -1.279125
H  2.535796 1.84215 2.489504
H  2.761792 2.233634 -2.420507
H  4.700694 1.585913 1.332899
H  4.823503 1.771676 -1.1349
totalener: -3928.09053039 hartree
nucrepener: 3663.14673727 hartree
electener: -7591.23726767 hartree
twoeener: 5131.73514861 hartree
kineticenergy: 3918.84917658 hartree
xcener: -198.394094450559 hartree
chargesum: 0.0000000
charge: -0.089349 -0.154893 -0.142982 -0.316269 -0.257778 -0.289223 0.326788 -0.073382 -0.042935 -0.299663 -0.352981 -0.153776 -0.132639 0.046603 -0.134735 -0.219035 0.203653 0.040459 -0.250503 -0.168841 0.275205 -0.097873 -0.216225 0.444290 0.318903 -0.243639 -0.221510 -0.121227 -0.084018 -0.149355 0.096396 0.088451 0.092481 0.092294 0.107710 0.103336 0.088823 0.105442 0.114376 0.101417 0.078132 0.096359 0.123408 0.136822 0.136419 0.107336 0.126232 0.134792 0.143310 0.116305 0.124761 0.121332 0.120997
qa: -0.0893 -0.1549 -0.1430 -0.3163 -0.2578 -0.2892 0.3268 -0.0734 -0.0429 -0.2997 -0.3530 -0.1538 -0.1326 0.0466 -0.1347 -0.2190 0.2037 0.0405 -0.2505 -0.1688 0.2752 -0.0979 -0.2162 0.4443 0.3189 -0.2436 -0.2215 -0.1212 -0.0840 -0.1494 0.0964 0.0885 0.0925 0.0923 0.1077 0.1033 0.0888 0.1054 0.1144 0.1014 0.0781 0.0964 0.1234 0.1368 0.1364 0.1073 0.1262 0.1348 0.1433 0.1163 0.1248 0.1213 0.1210
va: 1.1735 1.1419 1.1542 1.9842 2.0962 2.0909 3.7022 3.9712 3.6447 3.9210 3.9358 3.9763 4.0209 3.9304 4.1394 4.0713 3.7885 3.6137 4.0322 3.9929 3.7851 3.9420 3.9741 4.5548 3.6523 3.8789 4.0281 3.9585 3.8886 3.9616 0.9835 1.0045 1.0077 1.0055 1.0053 1.0005 1.0110 1.0112 1.0101 1.0174 0.9967 0.9877 1.0146 1.0090 1.0157 1.0111 1.0003 1.0044 1.0014 1.0180 1.0001 0.9985 1.0016
dispcorr: -0.034810348 hartree
energy: -3928.125340741289
dipole: -72.16930 70.91594 -1.25336 35.65562 -35.17519 0.48043 9.82601 -10.40929 -0.58328
magnitude: 1.46354 au
magnitude: 3.72002 debye
