program: Gaussian 09
title: 000074975
version: EM64L-G09RevD.01
frameworkgroup: C1[X(C20H16O10P2)]
method: RPBEPBE
basis: SDD
operation: Freq
keyword: #p
keyword: freq=noraman
keyword: PBEPBE/SDD
title: #p freq=noraman PBEPBE/SDD
converged: YES YES NO NO
title: Mulliken charges:
elementType: P P O O O O O O O O O O C C C C C C C C C C C C C C C C C C C C H H H H H H H H H H H H H H H H
charge: 1.335939 1.337413 -0.258382 -0.196633 -0.539895 -0.538344 -0.643544 -0.642042 -0.639806 -0.640735 -0.583769 -0.587156 -0.082967 0.267203 0.419604 0.452706 0.075487 0.070634 -0.362222 -0.370548 -0.319129 -0.371251 -0.374243 -0.370294 -0.229142 -0.218995 -0.386674 -0.390157 -0.338612 -0.367712 0.357868 0.361826 0.252817 0.256793 0.263893 0.274336 0.254227 0.270854 0.236333 0.238675 0.263322 0.264758 0.290632 0.290323 0.404716 0.403244 0.405904 0.402743
chargesum: 0.00000
title: Mulliken charges with hydrogens summed into heavy atoms:
elementType: P P O O O O O O O O O O C C C C C C C C C C C C C C C C C C C C
charge: 1.335939 1.337413 -0.258382 -0.196633 -0.539895 -0.538344 -0.238828 -0.238798 -0.233902 -0.237991 -0.583769 -0.587156 -0.082967 0.267203 0.419604 0.452706 0.075487 0.070634 -0.109405 -0.113754 -0.055236 -0.096915 -0.120016 -0.099441 0.007191 0.019679 -0.123351 -0.125399 -0.047980 -0.077389 0.357868 0.361826
polarizability: 3.52667250e+02 2.64461986e-01 3.01264679e+02 -1.21405529e+01 -3.82648518e-01 2.46293471e+02
1716.lowfreq: -5.0166 -3.8897 -0.0015 0.0007 0.0009 6.4186 10.1920 14.7926 18.6634
frequency: 9.9822 14.6806 18.6487 24.5438 33.9366 36.5047 40.8626 52.9571 57.7584 61.7663 79.8706 82.8549 87.0106 96.9928 136.2405 149.8658 157.7479 173.0261 199.6055 207.7600 220.9628 232.0402 240.3655 255.2995 265.7302 276.0412 294.5709 300.3449 310.1938 322.0164 331.2920 332.2598 342.3352 346.2208 357.9322 380.3277 391.4994 410.3023 414.2291 418.0896 430.5333 433.6692 491.9645 501.3484 520.0943 538.5095 555.7474 566.4698 569.6080 621.6903 630.9760 637.8290 653.9897 661.9218 665.5894 695.4934 712.9752 724.0936 729.5235 734.0514 752.6877 754.7982 761.8710 775.8208 787.0798 835.7446 841.2028 843.1187 845.4022 849.4582 854.1550 876.7214 889.2914 918.8076 933.5435 965.6278 968.1243 971.1924 981.7309 987.6342 994.6187 1002.7113 1010.2145 1010.2699 1010.9122 1012.4529 1028.6852 1034.9724 1036.5318 1060.3634 1062.7620 1089.8442 1118.2696 1121.4182 1155.6028 1163.4095 1166.7636 1174.9349 1197.9333 1202.2555 1205.2873 1225.4169 1242.0966 1279.6335 1302.6302 1309.5197 1363.8364 1372.2307 1401.7747 1407.4285 1412.5790 1450.3595 1460.7478 1488.6902 1491.3914 1584.6717 1587.5474 1604.9793 1611.2243 1612.9982 1617.2789 1698.0630 3135.7917 3137.6555 3145.3520 3148.3217 3149.9991 3151.3521 3158.7595 3163.2110 3172.3557 3174.8265 3178.2966 3178.7781 3596.0525 3596.1345 3596.3164 3597.3522
redmass: 8.2746 8.9854 8.0195 7.1216 5.8180 7.3098 5.1742 4.4589 6.2312 5.0543 4.0437 2.5817 3.8104 1.6552 5.1969 4.5670 4.5998 8.1558 5.6652 6.4586 4.4045 1.5660 1.7473 3.2597 4.1898 3.9142 5.8408 3.5312 4.1183 5.9533 8.6094 6.9888 6.9424 7.4810 6.6823 7.0257 5.9779 3.0762 3.0624 3.4438 7.9115 7.1939 4.8919 4.1242 6.5485 3.3007 8.0878 4.9035 6.8413 7.0885 7.3044 6.3595 8.6316 8.3426 5.5384 7.2102 7.9642 6.9751 4.3398 4.4539 6.3981 7.5955 2.9793 6.5313 1.7695 1.5794 1.5669 2.2131 2.9058 4.3223 1.5214 3.9654 1.5384 4.0293 5.3563 1.4024 1.4192 1.3976 1.3607 1.3588 5.9515 1.3376 2.6389 2.5013 1.5719 1.4037 2.2327 1.2912 1.2773 4.8989 4.6840 2.4201 1.3564 1.3563 2.1635 2.2122 2.2115 1.1478 1.4242 2.1484 1.8621 4.2441 4.0421 1.4941 1.2697 1.2733 6.8744 7.6224 8.6385 3.5074 3.3380 2.4836 2.5363 2.4387 2.4067 7.3999 7.5285 7.6062 6.3608 6.4435 7.1362 12.9805 1.0865 1.0893 1.0890 1.0899 1.0896 1.0909 1.0955 1.0962 1.1004 1.0948 1.0955 1.0963 1.0668 1.0666 1.0658 1.0663
irintensity: 0.2883 0.0219 0.0707 0.5669 1.9533 0.7155 1.0452 4.0843 4.7064 12.9059 3.1516 64.8866 40.2780 99.1630 1.2201 7.4035 11.2236 0.2278 7.1093 12.0651 32.3742 98.1081 47.3770 45.9013 21.5240 17.5605 5.8370 42.2249 25.5632 55.2887 46.8553 28.0706 15.7139 64.1490 16.5270 19.7558 17.7131 2.9792 1.6261 0.3956 12.5645 83.2065 8.3870 7.2910 15.0137 18.2048 3.3443 12.6833 6.2283 20.1811 1.2166 14.5305 10.2951 12.8371 13.4359 12.9289 438.5206 7.7548 1.3643 49.2117 194.0987 389.0351 12.3316 16.4964 35.4567 50.9714 110.1516 258.5239 265.2586 73.9142 49.4054 122.1149 7.4028 25.6610 4.0008 2.0207 11.8831 1.4432 2.1538 0.4111 122.7703 0.3503 13.5397 39.9903 20.0495 18.8919 26.8323 71.1990 62.5573 161.5959 195.8412 13.4635 11.9542 7.9405 13.4521 328.8033 121.3166 4.5597 36.9256 26.3880 23.3836 74.3113 85.1952 8.2131 2.0423 0.9723 15.8248 0.5400 3.9926 7.0929 5.8968 19.1981 8.8224 164.6269 150.7338 12.8410 12.0515 5.6457 64.2814 12.5107 18.2715 403.0734 2.7879 9.4176 3.9122 6.0674 5.1510 0.7238 8.8908 1.3481 19.6512 2.0472 0.1901 1.5814 106.2916 40.2200 145.0142 88.1458
temp: 298.150 k
press: 1.00000 atm
elementType: 15 15 8 8 8 8 8 8 8 8 8 8 6 6 6 6 6 6 6 6 6 6 6 6 6 6 6 6 6 6 6 6 1 1 1 1 1 1 1 1 1 1 1 1 1 1 1 1
symmnumber: 1
zpe: 857128.1 jmol-1
zpe.correction: 0.326463 hartree
zpe.thermalcorrener: 0.357913 hartree
zpe.thermalcorrenthalpy: 0.358858 hartree
zpe.thermalcorrgfe: 0.258391 hartree
zpe.sumelectzpe: -2204.134664 hartree
zpe.sumelectthermal: -2204.103213 hartree
zpe.sumelectthermalent: -2204.102269 hartree
zpe.sumelectthermalfe: -2204.202735 hartree
dipole: -0.3471 -0.8168 -5.2995
dipole: 5.3733
quadrupole: -179.6424 -181.2982 -209.5818
quadrupole: -1.9527 0.1142 -15.5690
quadrupole: 10.5317 8.8759 -19.4077 -1.9527 0.1142 -15.5690
hfenergy: -2204.4611267 hartree
pointgroup: C01 [X(C20H16O10P2)]
dipole: -0.1542043 0.2859812 2.0889019 debye
polarizability: 352.5345603|0.8584301|301.2741254|12.6436407|0.7679971|246.4167147 unknown
InChI: InChI=1S/C20H16O10P2/c21-19-17-3-1-2-4-18(17)20(28-19,13-5-9-15(10-6-13)29-31(22,23)24)14-7-11-16(12-8-14)30-32(25,26)27/h1-12,22-23,25-26H
charge 0 multiplicity 1
48 atoms
P  -6.426098 1.600722 0.015553
P  6.463962 1.815015 0.285945
O  0.152892 -1.357626 -1.818544
O  0.28307 -3.455218 -2.845394
O  -4.830593 2.182366 0.303665
O  4.847915 2.391298 0.121867
O  -6.661461 0.615107 1.389968
O  -7.307841 2.994475 0.458631
O  6.812404 1.377201 -1.325168
O  7.275726 3.312628 0.399761
O  -6.753574 0.958459 -1.39889
O  6.769999 0.740053 1.414193
C  0.066316 -0.806397 -0.401183
C  -0.023921 -2.081193 0.447724
C  -1.228847 0.014097 -0.284084
C  1.339285 0.021092 -0.187515
C  0.054415 -3.214363 -0.386335
C  0.181595 -2.786634 -1.80301
C  -0.186282 -2.230101 1.836908
C  -1.377801 0.941086 0.778951
C  1.465499 1.266575 -0.857172
C  -2.311774 -0.195873 -1.169328
C  2.426125 -0.450653 0.585126
C  -0.014906 -4.525879 0.125617
C  -0.256365 -3.542082 2.364874
C  -0.169284 -4.68106 1.520718
C  -2.591617 1.630267 0.96922
C  2.647293 2.022626 -0.760389
C  -3.529273 0.499802 -1.005101
C  3.614751 0.301673 0.709774
C  -3.656547 1.396713 0.076737
C  3.710569 1.531127 0.02546
H  -0.266925 -1.360613 2.497279
H  -0.540448 1.135673 1.457972
H  0.638713 1.634781 -1.473011
H  -2.19488 -0.884481 -2.010392
H  2.356503 -1.411392 1.104383
H  0.046367 -5.38511 -0.549972
H  -0.383739 -3.681701 3.443979
H  -0.228318 -5.683408 1.957706
H  -2.72578 2.340978 1.789319
H  2.764608 2.975066 -1.284229
H  -4.357368 0.348231 -1.705452
H  4.445521 -0.062589 1.323113
H  -7.405868 -0.034167 1.30992
H  -7.359232 3.697249 -0.238242
H  7.581414 0.761541 -1.432737
H  7.2508 3.737141 1.294885
