program: Orca
programVersion: 5.0.2
elementType: Br F F O O O C C C C C C C C C C C C C C C C C C C C C C C C H H H H H H H H H H H H H H H H H H H H H H H
charge: 0
multiplicity: 1
keywords: wb97x-d3
keywords: def2-TZVPP
keywords: def2/J RIJCOSX
keywords: DEFGRID2
keywords: scfconv7
keywords: smallprint printgap noloewdin
keywords: NOSOSCF
formula: C24H23BrF2O3
InChI: InChI=1/C24H23BrF2O3/c1-23(2,19-11-13-21(14-12-19)30-24(25,26)27)17-28-16-18-7-6-10-22(15-18)29-20-8-4-3-5-9-20/h3-15H,16-17H2,1-2H3
53 atoms
Br 3.006063 -2.56481 -1.299695
F  2.334426 -4.028701 0.835434
F  3.932613 -2.63672 1.219335
O  -3.567304 0.818579 0.314609
O  1.939239 -1.86466 1.168658
O  0.192518 3.928487 -0.797469
C  -3.616896 -1.554698 -0.078213
C  -4.171411 -0.37141 0.726105
C  -2.125812 -1.687627 0.212196
C  -3.878587 -1.34469 -1.573676
C  -4.398899 -2.795213 0.363558
C  -1.191106 -0.877426 -0.432411
C  -1.645676 -2.575341 1.17156
C  -3.889057 1.927405 1.099937
C  0.16014 -0.939111 -0.135139
C  -0.295865 -2.662265 1.476495
C  0.597729 -1.842217 0.816446
C  -3.053651 3.109917 0.69348
C  -1.789746 2.933637 0.144718
C  -3.538078 4.396216 0.900902
C  -1.02223 4.042004 -0.188493
C  -2.762364 5.494932 0.568554
C  -1.499589 5.326851 0.024902
C  2.753458 -2.775704 0.629397
C  1.101477 2.992527 -0.405095
C  1.951716 2.501368 -1.388116
C  1.244211 2.577924 0.914016
C  2.952867 1.605145 -1.046485
C  2.242278 1.67127 1.237687
C  3.103695 1.183466 0.266355
H  -5.263487 -0.322804 0.587158
H  -3.992021 -0.550265 1.797917
H  -4.952278 -1.289708 -1.761904
H  -3.440897 -0.427498 -1.960979
H  -3.481461 -2.17871 -2.15321
H  -5.44314 -2.708004 0.061058
H  -4.392017 -2.938316 1.445291
H  -3.997788 -3.698767 -0.096596
H  -1.50847 -0.171434 -1.185817
H  -2.323316 -3.225144 1.706745
H  -4.955866 2.182303 1.012762
H  -3.710144 1.709127 2.164812
H  0.859948 -0.279625 -0.630929
H  0.046322 -3.352033 2.235854
H  -1.406442 1.936275 -0.022946
H  -4.527774 4.541272 1.316686
H  -3.14496 6.493874 0.730223
H  -0.888861 6.178014 -0.245072
H  1.830774 2.835339 -2.410358
H  0.587975 2.957918 1.685819
H  3.613529 1.227684 -1.815712
H  2.34566 1.344497 2.263681
H  3.877238 0.4751 0.527911
totalener: -3928.09281558 hartree
nucrepener: 3562.77753833 hartree
electener: -7490.87035390 hartree
twoeener: 5030.86659038 hartree
kineticenergy: 3918.83466428 hartree
xcener: -198.391117432933 hartree
chargesum: 0.0000000
charge: -0.083098 -0.153256 -0.145006 -0.316382 -0.267220 -0.297117 0.286362 -0.052121 0.034649 -0.322539 -0.322840 -0.227486 -0.200190 0.072079 -0.106201 -0.110826 0.150157 0.011698 -0.156670 -0.190292 0.253791 -0.094793 -0.209906 0.435284 0.256413 -0.214808 -0.146813 -0.077193 -0.121862 -0.175907 0.084307 0.086514 0.086677 0.102703 0.108707 0.095617 0.085783 0.117476 0.128965 0.119260 0.071236 0.078133 0.131700 0.120282 0.092547 0.105576 0.123510 0.124886 0.123456 0.127766 0.124169 0.126046 0.126777
qa: -0.0831 -0.1533 -0.1450 -0.3164 -0.2672 -0.2971 0.2864 -0.0521 0.0346 -0.3225 -0.3228 -0.2275 -0.2002 0.0721 -0.1062 -0.1108 0.1502 0.0117 -0.1567 -0.1903 0.2538 -0.0948 -0.2099 0.4353 0.2564 -0.2148 -0.1468 -0.0772 -0.1219 -0.1759 0.0843 0.0865 0.0867 0.1027 0.1087 0.0956 0.0858 0.1175 0.1290 0.1193 0.0712 0.0781 0.1317 0.1203 0.0925 0.1056 0.1235 0.1249 0.1235 0.1278 0.1242 0.1260 0.1268
va: 1.1797 1.1440 1.1525 2.0058 2.1011 2.1176 3.7216 3.9675 3.6319 3.9334 3.9148 4.1377 4.0359 3.9214 3.9804 4.1043 3.8637 3.8191 3.9260 4.0035 3.7874 3.9581 4.0317 4.5652 3.7940 4.0019 3.8928 3.8755 3.9008 3.9083 0.9961 0.9992 1.0073 1.0139 1.0021 1.0105 1.0041 1.0016 1.0039 1.0045 0.9909 0.9863 1.0016 1.0151 1.0402 1.0129 1.0000 1.0137 1.0158 1.0059 1.0034 1.0030 1.0099
dispcorr: -0.032301091 hartree
energy: -3928.125116667879
dipole: -75.66850 74.13553 -1.53298 40.77442 -40.74533 0.02909 14.58536 -14.09207 0.49329
magnitude: 1.61065 au
magnitude: 4.09395 debye
