program: Gaussian 09
title: 000074759
version: EM64L-G09RevD.01
frameworkgroup: C1[X(C8H6I2O3)]
method: RPBEPBE
basis: SDD
operation: Freq
keyword: #pfreq=noraman
keyword: PBEPBE/SDD
title: #p freq=noraman PBEPBE/SDD
converged: YES YES NO NO
title: Mulliken charges:
elementType: I I O O O C C C C C C C C H H H H H H
charge: 0.125949 0.147363 -0.387354 -0.405042 -0.233174 0.470928 -0.616859 -0.373283 -0.293324 -0.499802 -0.486211 0.552707 0.216065 0.256211 0.253355 0.257580 0.286086 0.348154 0.380651
chargesum: 0.00000
title: Mulliken charges with hydrogens summed into heavy atoms:
elementType: I I O O O C C C C C C C C
charge: 0.125949 0.147363 -0.039199 -0.024391 -0.233174 0.470928 -0.107293 -0.115703 -0.007238 -0.499802 -0.486211 0.552707 0.216065
polarizability: 2.04160810e+02 -7.71912891e+00 1.68303806e+02 2.57748565e+00 9.05373546e+00 5.88674381e+01
1716.lowfreq: -2.3504 0.0004 0.0005 0.0005 2.4414 6.9564 21.0851 23.0019 68.6275
frequency: 21.0056 22.9651 68.6272 78.1909 97.8279 145.3921 171.7438 177.2303 213.3688 243.7257 334.5221 347.6703 371.4580 434.3776 456.2720 484.8253 513.3705 537.2162 564.3324 638.3126 684.4710 694.4283 724.5452 781.4983 842.8873 879.8064 896.7150 903.7647 940.6718 1033.8776 1061.2875 1131.6208 1179.2912 1205.6928 1238.9504 1267.0638 1285.2346 1331.1868 1374.4047 1396.5841 1447.8161 1458.9124 1550.7134 1590.9434 1660.6894 3004.5110 3104.2733 3158.7820 3170.6117 3447.6477 3506.3267
redmass: 8.4413 7.4765 13.0292 10.2163 20.7002 5.0032 7.4663 5.7561 11.2346 8.4998 6.4659 6.5927 3.1984 1.0973 3.3046 5.2063 4.8493 3.9151 2.9973 1.8619 5.1747 3.6481 6.1277 4.9366 2.8975 5.9441 1.9008 1.4435 2.0681 4.0538 2.0306 1.5895 1.2413 1.7090 1.8720 1.5305 2.1927 2.2526 5.6773 2.5060 1.5485 1.8961 6.6263 7.2873 8.6072 1.0651 1.0964 1.0926 1.0930 1.0649 1.0639
irintensity: 2.8410 0.5819 0.8822 0.4368 0.0948 1.8045 0.8860 0.7474 0.4205 4.9408 3.1632 3.1479 3.4647 129.2288 5.2343 1.5257 33.1041 38.5676 20.6867 122.0425 72.3719 40.8155 14.8064 17.3437 20.0321 5.3372 7.8283 3.7632 33.1742 2.1299 280.5748 216.8490 17.1303 4.7324 67.6176 17.0586 29.3437 46.5291 26.7601 66.3932 76.7979 52.3951 48.7248 2.8270 186.4405 10.5695 3.8375 2.6276 1.7405 73.8179 27.0421
temp: 298.150 k
press: 1.00000 atm
elementType: 53 53 8 8 8 6 6 6 6 6 6 6 6 1 1 1 1 1 1
symmnumber: 1
zpe: 322259.9 jmol-1
zpe.correction: 0.122742 hartree
zpe.thermalcorrener: 0.136058 hartree
zpe.thermalcorrenthalpy: 0.137002 hartree
zpe.thermalcorrgfe: 0.077582 hartree
zpe.sumelectzpe: -556.193427 hartree
zpe.sumelectthermal: -556.180112 hartree
zpe.sumelectthermalent: -556.179168 hartree
zpe.sumelectthermalfe: -556.238588 hartree
dipole: 0.8746 1.6213 0.3795
dipole: 1.8808
quadrupole: -109.1471 -87.8440 -103.2206
quadrupole: -3.4598 -0.8101 0.3165
quadrupole: -9.0765 12.2265 -3.1500 -3.4598 -0.8101 0.3165
hfenergy: -556.3161697 hartree
pointgroup: C01 [X(C8H6I2O3)]
dipole: -0.7083055 0.1331057 0.1676907 debye
dipolederiv: -0.1327928 -0.1372079 0.0583001 -0.1284841 -0.4541146 0.0986819 0.0623245 0.1065132 0.0060992 -0.0957532 0.1967938 -0.0036632 0.2422626 -0.3459273 0.0044666 -0.0029214 0.0085163 0.0343336 -1.2045975 -0.1810431 0.2085055 -0.0486646 -0.1810768 -0.022519 0.2131781 0.0158299 -0.4239315 -0.9276205 -0.4062203 -0.117126 -0.4542486 -0.6261227 -0.2286449 -0.3337133 -0.2927363 -0.4356989 -0.6397477 0.07994 -0.1321042 -0.0882552 -0.8731067 0.0234873 -0.2070915 0.2038088 -0.4487421 0.3105456 -0.0551372 -0.0076205 0.0575434 -0.0312306 0.0349277 -0.1763151 0.0394211 -0.0679075 -0.2415814 0.0754707 -0.1554055 0.1186846 -0.0143321 0.046281 -0.138416 0.0743025 -0.0380597 -0.1523633 0.0056513 -0.0159926 0.2045333 -0.1978111 -0.0394626 -0.0239904 0.0168293 -0.0780413 -0.1711994 0.0789279 -0.0000752 -0.243128 -0.2746319 0.0764931 0.0852172 -0.0171173 -0.0743987 0.0406614 0.2403897 -0.0926364 0.5913309 0.902664 -0.2876988 -0.1412045 -0.226177 -0.1206374 0.1084369 -0.3363544 -0.0209898 -0.6985872 0.8518948 0.005564 0.0432298 -0.0707595 -0.1718784 0.8905928 0.1637995 -0.1966265 0.0957217 -0.5447231 0.0804883 -0.1986446 0.0619378 0.1881732 1.1710934 0.2584514 0.4903739 0.3526981 1.2456285 0.0381317 0.859072 -0.0795156 0.630267 0.0083807 0.0176777 0.0267508 0.0605158 0.042265 -0.0879909 0.0519118 -0.0453577 0.0015022 0.0504648 -0.0159486 0.0030833 -0.0549082 -0.0486721 0.0560455 -0.0138013 0.0284701 0.0949302 0.0733277 -0.0735993 0.0350035 -0.0694149 0.0070422 0.0358964 0.0260156 0.03797 0.135228 0.1488799 0.0604499 0.0167897 0.0535139 0.0536202 0.0032876 0.0077707 0.0168958 0.1440383 0.4136977 -0.016957 -0.0082371 -0.0778944 0.2705324 0.0388373 -0.0023402 0.0195362 0.3548056 0.3495749 0.0449158 -0.0883299 0.0867809 0.218102 0.1237278 -0.1102814 0.1016324 0.2699181 unknown
polarizability: 166.2791334|-7.6505258|201.7393978|-13.8622786|-21.3548137|63.3135231 unknown
InChI: InChI=1S/C8H6I2O3/c9-5-1-4(3-7(11)12)2-6(10)8(5)13/h1-2,11,13H,3H2
charge 0 multiplicity 1
19 atoms
I  2.203232 3.022666 -0.619854
I  2.543035 -3.070094 0.225717
O  3.398537 -0.073146 -0.446367
O  -3.9805 -0.49751 -0.565264
O  -3.107065 1.650367 -0.443317
C  -0.718061 -0.089815 0.604227
C  -2.190493 -0.132076 1.012805
C  0.048362 -1.279638 0.589071
C  -0.09624 1.134405 0.254424
C  1.265157 1.148856 -0.094608
C  1.412427 -1.253448 0.238046
C  2.053824 -0.036145 -0.111539
C  -3.103867 0.463173 -0.050542
H  -2.340236 0.464975 1.932928
H  -2.50504 -1.165604 1.221189
H  -0.419804 -2.233078 0.851057
H  -0.685338 2.055489 0.240581
H  3.73118 0.837528 -0.676439
H  -4.55641 -0.081805 -1.264316
