program: Orca
programVersion: 5.0.2
elementType: Cl F F F O O O N N C C C C C C C C C C C C C C C C C C C C C C C C C C H H H H H H H H H H H H H H H H H H H H H H
charge: 0
multiplicity: 1
keywords: wb97x-d3
keywords: def2-TZVPP
keywords: def2/J RIJCOSX
keywords: DEFGRID2
keywords: scfconv7
keywords: smallprint printgap noloewdin
keywords: NOSOSCF
formula: C26H22ClF3N2O3
InChI: InChI=1/C26H22ClF3N2O3/c1-16(2)24(32-22-12-11-18(14-21(22)27)26(28,29)30)25(33)35-23(15-31)17-7-6-10-20(13-17)34-19-8-4-3-5-9-19/h3-14,16,23-24,32H,1-2H3
57 atoms
Cl 0.522356 2.62223 -2.322958
F  -3.022594 0.255897 1.95881
F  -3.293617 2.346557 2.364134
F  -3.737429 1.569731 0.410091
O  2.786968 -0.302227 0.181012
O  4.396748 -0.144408 1.718305
O  -2.004681 -1.167313 -0.914352
N  2.517535 2.308291 -0.142352
N  2.051201 -2.204021 2.927199
C  4.975921 2.267099 -0.057843
C  3.649825 1.871134 0.626242
C  5.213072 1.534112 -1.374949
C  5.058349 3.776341 -0.242048
C  3.667976 0.375342 0.912956
C  1.225824 2.126945 0.250711
C  2.614658 -1.692751 0.422675
C  0.167209 2.245147 -0.665458
C  0.8735 1.828942 1.576976
C  1.444077 -2.144586 -0.413344
C  -1.466304 1.736812 1.009393
C  -1.150013 2.05092 -0.303833
C  -0.441535 1.634814 1.945407
C  0.22167 -1.498629 -0.263338
C  1.582506 -3.192683 -1.30933
C  -2.873322 1.480998 1.426657
C  -0.854555 -1.893984 -1.037035
C  2.322168 -1.945001 1.839681
C  0.485997 -3.590198 -2.065619
C  -0.733084 -2.945098 -1.941238
C  -3.219042 -1.800045 -0.85823
C  -3.409783 -2.970948 -0.135209
C  -4.278319 -1.185198 -1.510293
C  -4.680409 -3.526928 -0.075176
C  -5.54403 -1.748223 -1.433751
C  -5.750869 -2.921364 -0.720011
H  5.76289 1.971532 0.63982
H  3.643927 2.357667 1.606975
H  4.442931 1.747337 -2.119588
H  5.266937 0.451301 -1.24904
H  6.163314 1.851695 -1.804795
H  4.351552 4.138098 -0.989924
H  6.057615 4.054059 -0.578536
H  4.862607 4.305997 0.691531
H  2.671129 2.380345 -1.136669
H  3.51933 -2.24917 0.160107
H  1.637689 1.740896 2.337448
H  -1.916465 2.14187 -1.061112
H  -0.657382 1.394625 2.978801
H  0.097235 -0.690369 0.448501
H  2.535367 -3.693137 -1.422468
H  0.587075 -4.404482 -2.770653
H  -1.574486 -3.25284 -2.549037
H  -2.585478 -3.445089 0.383127
H  -4.111881 -0.274421 -2.071449
H  -4.831494 -4.438652 0.488084
H  -6.369965 -1.267266 -1.941449
H  -6.738383 -3.359712 -0.665145
elementType: Cl F O N C H
totalener: -2099.11895275 hartree
nucrepener: 4084.80135160 hartree
electener: -6183.92030435 hartree
twoeener: 4820.98813119 hartree
cpcmener: -0.04680140 hartree
kineticenergy: 2091.77246946 hartree
xcener: -173.911275995114 hartree
chargesum: -0.0000000
charge: -0.099365 -0.191952 -0.188311 -0.187269 -0.251118 -0.439781 -0.325564 -0.242486 -0.091957 0.072014 0.094923 -0.296222 -0.300571 0.348080 0.175424 0.406753 0.008794 -0.231338 0.002267 -0.097810 -0.137474 -0.129580 -0.236952 -0.160723 0.582576 0.203329 -0.238135 -0.135925 -0.159772 0.275486 -0.186261 -0.269627 -0.144899 -0.112070 -0.187976 0.058332 0.136440 0.084268 0.094342 0.102141 0.081817 0.101169 0.097011 0.159831 0.142347 0.141325 0.129462 0.145280 0.136828 0.149602 0.163339 0.161571 0.157940 0.146588 0.162167 0.160511 0.161181
qa: -0.0994 -0.1920 -0.1883 -0.1873 -0.2511 -0.4398 -0.3256 -0.2425 -0.0920 0.0720 0.0949 -0.2962 -0.3006 0.3481 0.1754 0.4068 0.0088 -0.2313 0.0023 -0.0978 -0.1375 -0.1296 -0.2370 -0.1607 0.5826 0.2033 -0.2381 -0.1359 -0.1598 0.2755 -0.1863 -0.2696 -0.1449 -0.1121 -0.1880 0.0583 0.1364 0.0843 0.0943 0.1021 0.0818 0.1012 0.0970 0.1598 0.1423 0.1413 0.1295 0.1453 0.1368 0.1496 0.1633 0.1616 0.1579 0.1466 0.1622 0.1605 0.1612
va: 1.2288 1.0944 1.1066 1.1123 2.1729 2.0669 2.0283 3.2035 3.1074 3.8016 3.8816 3.9486 3.9462 4.1737 3.8392 3.7442 3.8759 3.8796 3.7237 3.6010 3.9612 4.0087 3.9991 3.9116 4.3904 3.8485 4.0532 3.9103 3.9307 3.5949 3.9231 3.9928 3.8889 3.8670 3.8965 1.0287 1.0006 1.0054 1.0134 1.0020 1.0107 1.0032 1.0043 1.0372 1.0107 1.0108 1.0250 1.0083 1.0297 1.0007 0.9893 0.9930 0.9992 1.0095 0.9890 0.9882 0.9891
dispcorr: -0.037408310 hartree
energy: -2099.156361059408
dipole: 30.56160 -28.90387 1.65773 -6.95152 6.85812 -0.09339 -11.16711 8.52748 -2.63963
magnitude: 3.11840 au
magnitude: 7.92636 debye
