program: Orca
programVersion: 5.0.2
elementType: Cl F F F O O O N N C C C C C C C C C C C C C C C C C C C C C C C C C C H H H H H H H H H H H H H H H H H H H H H H
charge: 0
multiplicity: 1
keywords: wb97x-d3
keywords: def2-TZVPP
keywords: def2/J RIJCOSX
keywords: DEFGRID2
keywords: scfconv7
keywords: smallprint printgap noloewdin
keywords: NOSOSCF
formula: C26H22ClF3N2O3
InChI: InChI=1/C26H22ClF3N2O3/c1-16(2)24(32-22-12-11-18(14-21(22)27)26(28,29)30)25(33)35-23(15-31)17-7-6-10-20(13-17)34-19-8-4-3-5-9-19/h3-14,16,23-24,32H,1-2H3
57 atoms
Cl -0.340752 1.703244 -2.315239
F  -2.634869 -0.282678 2.736544
F  -2.971663 1.768095 3.263663
F  -3.825385 0.971155 1.455999
O  2.785047 -0.255409 0.054904
O  4.321083 0.441439 1.514068
O  -2.027718 -2.054208 0.144723
N  2.036356 2.200549 -0.591457
N  2.454546 -1.63129 3.197556
C  4.418117 2.356642 -1.078472
C  3.346056 2.050416 -0.008516
C  4.259794 3.792988 -1.568288
C  5.837759 2.136673 -0.568376
C  3.560544 0.673859 0.610454
C  0.888649 1.92738 0.094012
C  2.768677 -1.570186 0.599898
C  -0.318425 1.67679 -0.579291
C  0.842096 1.897726 1.49595
C  1.584417 -2.274154 -0.01083
C  -1.501039 1.343355 1.475947
C  -1.490635 1.389521 0.088943
C  -0.324685 1.603183 2.170669
C  0.302539 -1.83514 0.304562
C  1.770873 -3.320248 -0.899533
C  -2.730426 0.956302 2.22321
C  -0.78913 -2.464033 -0.264247
C  2.620108 -1.556434 2.061519
C  0.663076 -3.937305 -1.469025
C  -0.619044 -3.519768 -1.154553
C  -3.005289 -1.770835 -0.77075
C  -2.729241 -1.290883 -2.044821
C  -4.31606 -1.92564 -0.338737
C  -3.784986 -0.974491 -2.889658
C  -5.358635 -1.599632 -1.192642
C  -5.10021 -1.127016 -2.47294
H  4.245479 1.676108 -1.920011
H  3.484182 2.766074 0.80822
H  4.373245 4.498888 -0.742895
H  3.294424 3.97648 -2.03804
H  5.028196 4.020141 -2.307655
H  6.026821 2.700266 0.34734
H  6.548428 2.483574 -1.318723
H  6.06636 1.088726 -0.378298
H  2.005455 2.016071 -1.58394
H  3.69954 -2.093224 0.362053
H  1.729933 2.113169 2.075538
H  -2.385417 1.197622 -0.487484
H  -0.301211 1.580876 3.252499
H  0.142298 -1.019425 1.001418
H  2.770107 -3.655043 -1.145998
H  0.800984 -4.758512 -2.159138
H  -1.476106 -4.016756 -1.591167
H  -1.710146 -1.148997 -2.38104
H  -4.514004 -2.294604 0.659882
H  -3.570597 -0.598871 -3.881728
H  -6.379048 -1.721997 -0.853641
H  -5.916137 -0.877238 -3.137715
elementType: Cl F O N C H
totalener: -2099.11737098 hartree
nucrepener: 4140.32449127 hartree
electener: -6239.44186225 hartree
twoeener: 4876.19892885 hartree
cpcmener: -0.04703875 hartree
kineticenergy: 2091.77799144 hartree
xcener: -173.912195008444 hartree
chargesum: -0.0000000
charge: -0.099655 -0.189740 -0.187305 -0.185381 -0.253142 -0.435756 -0.331867 -0.217999 -0.091695 0.078212 0.065100 -0.294010 -0.307061 0.372692 0.174518 0.416483 0.017218 -0.229132 0.005100 -0.089687 -0.134630 -0.154464 -0.246059 -0.157179 0.571571 0.201461 -0.246437 -0.135843 -0.155344 0.356002 -0.227706 -0.304010 -0.144706 -0.100010 -0.197778 0.062017 0.126397 0.090135 0.091922 0.095885 0.095855 0.094374 0.092341 0.149822 0.141927 0.145312 0.139082 0.144837 0.142316 0.150340 0.163971 0.159857 0.144760 0.144299 0.160743 0.161055 0.160996
qa: -0.0997 -0.1897 -0.1873 -0.1854 -0.2531 -0.4358 -0.3319 -0.2180 -0.0917 0.0782 0.0651 -0.2940 -0.3071 0.3727 0.1745 0.4165 0.0172 -0.2291 0.0051 -0.0897 -0.1346 -0.1545 -0.2461 -0.1572 0.5716 0.2015 -0.2464 -0.1358 -0.1553 0.3560 -0.2277 -0.3040 -0.1447 -0.1000 -0.1978 0.0620 0.1264 0.0901 0.0919 0.0959 0.0959 0.0944 0.0923 0.1498 0.1419 0.1453 0.1391 0.1448 0.1423 0.1503 0.1640 0.1599 0.1448 0.1443 0.1607 0.1611 0.1610
va: 1.2302 1.0922 1.1112 1.1149 2.1913 2.0583 2.0320 3.1955 3.1076 3.8031 3.8895 3.9356 3.9470 4.1131 3.8554 3.7516 3.8772 3.8922 3.7016 3.6022 3.9383 4.0235 4.0010 3.9176 4.4129 3.8571 4.0528 3.8997 3.9325 3.4941 3.8641 3.9991 3.9097 3.8611 3.9150 1.0227 1.0038 1.0012 1.0171 1.0052 1.0052 1.0040 1.0089 1.0436 1.0062 1.0112 1.0084 1.0094 1.0185 0.9998 0.9888 0.9942 1.0148 1.0123 0.9899 0.9873 0.9891
dispcorr: -0.039340600 hartree
energy: -2099.156711581984
dipole: 32.21952 -30.68450 1.53501 2.70047 -2.60849 0.09198 -21.14733 17.42965 -3.71768
magnitude: 4.02317 au
magnitude: 10.22608 debye
