program: Orca
programVersion: 5.0.2
elementType: Cl F F F O O O N N C C C C C C C C C C C C C C C C C C C C C C C C C C H H H H H H H H H H H H H H H H H H H H H H
charge: 0
multiplicity: 1
keywords: wb97x-d3
keywords: def2-TZVPP
keywords: def2/J RIJCOSX
keywords: DEFGRID2
keywords: scfconv7
keywords: smallprint printgap noloewdin
keywords: NOSOSCF
formula: C26H22ClF3N2O3
InChI: InChI=1/C26H22ClF3N2O3/c1-16(2)24(32-22-12-11-18(14-21(22)27)26(28,29)30)25(33)35-23(15-31)17-7-6-10-20(13-17)34-19-8-4-3-5-9-19/h3-14,16,23-24,32H,1-2H3
57 atoms
Cl 0.265202 2.351967 -2.541734
F  -3.385065 2.188718 2.39073
F  -4.015877 1.951301 0.349355
F  -3.501739 0.229182 1.530519
O  3.310758 -0.486744 -0.47193
O  3.566493 -0.336324 1.742326
O  -1.7044 -1.341099 -1.228493
N  2.26069 2.062087 -0.360316
N  4.797678 -3.289938 0.83507
C  4.700577 2.176978 -0.252858
C  3.407482 1.695988 0.431031
C  4.714308 3.697602 -0.347584
C  5.934101 1.68049 0.492418
C  3.443889 0.194673 0.670915
C  0.971185 1.863287 0.03275
C  2.982438 -1.871412 -0.399321
C  -0.090668 2.005946 -0.878213
C  0.618384 1.551817 1.355712
C  1.575172 -2.049981 0.115739
C  -1.732051 1.61645 0.822789
C  -1.411775 1.893589 -0.498826
C  -0.70207 1.432397 1.739402
C  0.54899 -1.694554 -0.751581
C  1.286054 -2.473768 1.404814
C  -3.150815 1.498861 1.26422
C  -0.768653 -1.749516 -0.324033
C  3.988636 -2.640187 0.338496
C  -0.036724 -2.518463 1.821124
C  -1.068784 -2.146765 0.974534
C  -2.987569 -1.823053 -1.218241
C  -3.296994 -3.144247 -0.920618
C  -3.980608 -0.931645 -1.600443
C  -4.620136 -3.559018 -0.984501
C  -5.295752 -1.364842 -1.674367
C  -5.623973 -2.676181 -1.358157
H  4.717693 1.763569 -1.267088
H  3.353092 2.168178 1.416322
H  4.678733 4.15143 0.64509
H  3.878693 4.088902 -0.926708
H  5.631504 4.032462 -0.833106
H  5.922543 2.000483 1.536096
H  6.832843 2.089989 0.031134
H  6.036487 0.59449 0.472086
H  2.428354 2.115045 -1.354179
H  3.040041 -2.214715 -1.434525
H  1.382273 1.420806 2.108887
H  -2.180998 2.028118 -1.246876
H  -0.915557 1.200028 2.77484
H  0.770114 -1.37067 -1.762009
H  2.071569 -2.768858 2.087465
H  -0.269852 -2.836785 2.828107
H  -2.088939 -2.180416 1.330764
H  -2.525799 -3.851235 -0.643809
H  -3.720636 0.088097 -1.853686
H  -4.861847 -4.586067 -0.744394
H  -6.06697 -0.668549 -1.976133
H  -6.652146 -3.008574 -1.406118
elementType: Cl F O N C H
totalener: -2099.11731947 hartree
nucrepener: 4120.01881069 hartree
electener: -6219.13613016 hartree
twoeener: 4855.66159994 hartree
cpcmener: -0.04373404 hartree
kineticenergy: 2091.78289502 hartree
xcener: -173.915170176460 hartree
chargesum: -0.0000000
charge: -0.097188 -0.187831 -0.187645 -0.184756 -0.268665 -0.419777 -0.326189 -0.208056 -0.093778 0.065209 0.104292 -0.295528 -0.301145 0.340844 0.149772 0.427154 0.024875 -0.186791 0.042354 -0.024388 -0.166125 -0.237597 -0.330136 -0.179440 0.579510 0.367483 -0.233884 -0.133424 -0.251413 0.328373 -0.221935 -0.277587 -0.150225 -0.120667 -0.186993 0.062566 0.124597 0.088675 0.091987 0.097595 0.097258 0.095353 0.093764 0.153672 0.146650 0.137986 0.131610 0.147040 0.126107 0.137754 0.162730 0.151208 0.159862 0.152676 0.161924 0.159602 0.160685
qa: -0.0972 -0.1878 -0.1876 -0.1848 -0.2687 -0.4198 -0.3262 -0.2081 -0.0938 0.0652 0.1043 -0.2955 -0.3011 0.3408 0.1498 0.4272 0.0249 -0.1868 0.0424 -0.0244 -0.1661 -0.2376 -0.3301 -0.1794 0.5795 0.3675 -0.2339 -0.1334 -0.2514 0.3284 -0.2219 -0.2776 -0.1502 -0.1207 -0.1870 0.0626 0.1246 0.0887 0.0920 0.0976 0.0973 0.0954 0.0938 0.1537 0.1467 0.1380 0.1316 0.1470 0.1261 0.1378 0.1627 0.1512 0.1599 0.1527 0.1619 0.1596 0.1607
va: 1.2346 1.1095 1.1119 1.0910 2.1514 2.0738 2.0397 3.1981 3.1046 3.8092 3.8583 3.9393 3.9548 4.0911 3.8670 3.8995 3.8473 3.8337 3.5867 3.5349 3.9730 4.0630 4.0584 3.9328 4.3863 3.5215 4.0528 3.9551 3.9195 3.6339 3.9158 3.9557 3.8873 3.8978 3.9065 1.0262 1.0062 1.0012 1.0174 1.0044 1.0040 1.0031 1.0082 1.0453 0.9953 1.0214 1.0215 1.0099 1.0273 1.0192 0.9894 1.0107 0.9965 1.0066 0.9892 0.9901 0.9891
dispcorr: -0.039798701 hartree
energy: -2099.157118166125
dipole: 30.04882 -29.94673 0.10209 -3.47290 4.32113 0.84823 -0.78557 -0.53102 -1.31660
magnitude: 1.56951 au
magnitude: 3.98937 debye
