program: Orca
programVersion: 5.0.2
elementType: Cl F F F O O O N N C C C C C C C C C C C C C C C C C C C C C C C C C C H H H H H H H H H H H H H H H H H H H H H H
charge: 0
multiplicity: 1
keywords: wb97x-d3
keywords: def2-TZVPP
keywords: def2/J RIJCOSX
keywords: DEFGRID2
keywords: scfconv7
keywords: smallprint printgap noloewdin
keywords: NOSOSCF
formula: C26H22ClF3N2O3
InChI: InChI=1/C26H22ClF3N2O3/c1-16(2)24(32-22-12-11-18(14-21(22)27)26(28,29)30)25(33)35-23(15-31)17-7-6-10-20(13-17)34-19-8-4-3-5-9-19/h3-14,16,23-24,32H,1-2H3
57 atoms
Cl 1.353065 3.150633 -2.486201
F  -3.56181 0.717393 -1.21291
F  -3.903339 1.748598 0.643202
F  -3.750185 2.855457 -1.19428
O  3.319078 -0.267179 -0.316062
O  2.602758 -0.736464 1.746137
O  -1.346497 -3.441113 0.496266
N  2.379887 2.297089 0.175373
N  4.112818 -3.480526 0.578003
C  4.604078 1.992007 1.154101
C  3.127794 1.561501 1.167187
C  4.729258 3.457592 1.550755
C  5.43455 1.114763 2.083133
C  2.982866 0.064974 0.934759
C  1.031823 2.146896 0.013794
C  2.973107 -1.565104 -0.787674
C  0.392075 2.543157 -1.174686
C  0.207848 1.6327 1.023935
C  1.47775 -1.704544 -0.945883
C  -1.7661 1.95169 -0.315638
C  -0.972427 2.450652 -1.342544
C  -1.160453 1.538325 0.862575
C  0.7117 -2.52091 -0.128797
C  0.870969 -0.930317 -1.93065
C  -3.236995 1.820998 -0.514917
C  -0.663857 -2.579545 -0.316155
C  3.590703 -2.621105 0.019515
C  -0.50107 -0.996569 -2.102092
C  -1.278101 -1.826771 -1.30722
C  -2.662906 -3.193483 0.80871
C  -3.086469 -1.944858 1.246188
C  -3.547606 -4.257387 0.727272
C  -4.418363 -1.765072 1.589036
C  -4.874309 -4.067518 1.089422
C  -5.316237 -2.822225 1.513335
H  4.98209 1.871848 0.133042
H  2.729862 1.763309 2.165023
H  4.191342 4.120204 0.873437
H  5.777284 3.759362 1.538855
H  4.346986 3.622583 2.56041
H  5.472787 0.072564 1.761313
H  5.047023 1.139962 3.103566
H  6.463317 1.474051 2.111087
H  2.905162 2.519646 -0.658201
H  3.444891 -1.624851 -1.771358
H  0.631762 1.3174 1.966428
H  -1.407477 2.76748 -2.281616
H  -1.744059 1.143165 1.682781
H  1.161727 -3.123003 0.651108
H  1.465338 -0.282383 -2.562543
H  -0.976118 -0.405551 -2.873518
H  -2.34559 -1.884725 -1.47162
H  -2.388005 -1.121364 1.324743
H  -3.20085 -5.225058 0.387826
H  -4.751911 -0.792194 1.925258
H  -5.564764 -4.898282 1.029078
H  -6.352875 -2.676134 1.785309
elementType: Cl F O N C H
totalener: -2099.11793558 hartree
nucrepener: 4080.96203154 hartree
electener: -6180.07996713 hartree
twoeener: 4816.10391541 hartree
cpcmener: -0.04427236 hartree
kineticenergy: 2091.78295189 hartree
xcener: -173.913147085057 hartree
chargesum: 0.0000000
charge: -0.097481 -0.185372 -0.186048 -0.185496 -0.267021 -0.420876 -0.337135 -0.223161 -0.092283 0.058725 0.121044 -0.296414 -0.298775 0.330870 0.164857 0.440594 0.010365 -0.194991 0.002808 -0.053710 -0.150020 -0.201399 -0.189384 -0.257717 0.571889 0.272333 -0.240366 -0.131083 -0.203867 0.262045 -0.188169 -0.223809 -0.175507 -0.141732 -0.165272 0.062171 0.124985 0.093716 0.097175 0.088612 0.092930 0.097561 0.095357 0.154220 0.149699 0.140945 0.126150 0.158206 0.124879 0.136584 0.163543 0.152059 0.186528 0.147718 0.156149 0.161253 0.161122
qa: -0.0975 -0.1854 -0.1860 -0.1855 -0.2670 -0.4209 -0.3371 -0.2232 -0.0923 0.0587 0.1210 -0.2964 -0.2988 0.3309 0.1649 0.4406 0.0104 -0.1950 0.0028 -0.0537 -0.1500 -0.2014 -0.1894 -0.2577 0.5719 0.2723 -0.2404 -0.1311 -0.2039 0.2620 -0.1882 -0.2238 -0.1755 -0.1417 -0.1653 0.0622 0.1250 0.0937 0.0972 0.0886 0.0929 0.0976 0.0954 0.1542 0.1497 0.1409 0.1261 0.1582 0.1249 0.1366 0.1635 0.1521 0.1865 0.1477 0.1561 0.1613 0.1611
va: 1.2295 1.0914 1.1138 1.1136 2.1526 2.0737 2.0769 3.1969 3.1021 3.8120 3.8570 3.9386 3.9549 4.1088 3.8549 3.8699 3.8453 3.8917 3.6455 3.5814 4.0438 3.9905 4.0217 3.9652 4.3922 3.8170 4.0665 3.8485 3.8747 3.7214 3.8798 3.9866 3.9095 3.8883 3.8922 1.0265 1.0047 1.0161 1.0044 1.0014 1.0086 1.0039 1.0033 1.0454 0.9929 1.0201 1.0279 0.9969 1.0369 1.0144 0.9905 1.0060 0.9702 1.0065 1.0011 0.9881 0.9891
dispcorr: -0.039163116 hartree
energy: -2099.157098696370
dipole: 27.24240 -26.58894 0.65347 -5.98862 8.08778 2.09916 17.81203 -18.97481 -1.16278
magnitude: 2.48708 au
magnitude: 6.32166 debye
