program: Orca
programVersion: 5.0.2
elementType: Cl F F F O O O N N C C C C C C C C C C C C C C C C C C C C C C C C C C H H H H H H H H H H H H H H H H H H H H H H
charge: 0
multiplicity: 1
keywords: wb97x-d3
keywords: def2-TZVPP
keywords: def2/J RIJCOSX
keywords: DEFGRID2
keywords: scfconv7
keywords: smallprint printgap noloewdin
keywords: NOSOSCF
formula: C26H22ClF3N2O3
InChI: InChI=1/C26H22ClF3N2O3/c1-16(2)24(32-22-12-11-18(14-21(22)27)26(28,29)30)25(33)35-23(15-31)17-7-6-10-20(13-17)34-19-8-4-3-5-9-19/h3-14,16,23-24,32H,1-2H3
57 atoms
Cl 0.019436 1.665196 -2.384259
F  -2.957409 0.025589 2.473244
F  -3.161059 2.128152 2.844236
F  -3.880464 1.290163 0.996932
O  2.77952 -0.309708 0.138226
O  4.638371 0.127753 1.291744
O  -1.979531 -1.982204 0.18639
N  2.210861 2.176849 -0.429951
N  2.839374 -2.142923 3.019703
C  4.645524 2.524223 -0.535233
C  3.451972 1.965685 0.263354
C  4.856903 1.819885 -1.871505
C  4.50868 4.029593 -0.718604
C  3.709589 0.506962 0.626118
C  0.995572 1.918067 0.136635
C  2.844017 -1.696982 0.44027
C  -0.142664 1.696611 -0.65539
C  0.806382 1.884067 1.526434
C  1.607066 -2.326758 -0.148067
C  -1.551538 1.475528 1.266442
C  -1.393252 1.487372 -0.111102
C  -0.43812 1.666988 2.07798
C  0.357643 -1.860475 0.24758
C  1.716408 -3.341133 -1.085401
C  -2.883153 1.231887 1.885291
C  -0.781346 -2.428055 -0.294651
C  2.865267 -1.916692 1.892129
C  0.562588 -3.90142 -1.61985
C  -0.688521 -3.455847 -1.228748
C  -3.036054 -1.758946 -0.656437
C  -4.302712 -1.984953 -0.135688
C  -2.875384 -1.267528 -1.946045
C  -5.418366 -1.712851 -0.91321
C  -4.001977 -1.010615 -2.715393
C  -5.274946 -1.229606 -2.206784
H  5.525703 2.341809 0.085854
H  3.439003 2.505143 1.215053
H  4.040229 1.998644 -2.574201
H  4.976873 0.740605 -1.763229
H  5.763693 2.197215 -2.344604
H  3.68223 4.28562 -1.381555
H  5.419164 4.437356 -1.158171
H  4.346087 4.534917 0.234491
H  2.260324 2.027033 -1.42678
H  3.747817 -2.144155 0.016228
H  1.643431 2.035725 2.193414
H  -2.232113 1.33073 -0.775413
H  -0.527293 1.652974 3.156534
H  0.26013 -1.067965 0.981553
H  2.690814 -3.694708 -1.39578
H  0.639069 -4.699335 -2.345941
H  -1.579203 -3.91068 -1.642577
H  -4.412152 -2.366546 0.871283
H  -1.890377 -1.071925 -2.350571
H  -6.404795 -1.887183 -0.504241
H  -3.877829 -0.628487 -3.720045
H  -6.14723 -1.023356 -2.81219
elementType: Cl F O N C H
totalener: -2099.11949140 hartree
nucrepener: 4126.46915231 hartree
electener: -6225.58864371 hartree
twoeener: 4862.16334140 hartree
cpcmener: -0.04706424 hartree
kineticenergy: 2091.80077576 hartree
xcener: -173.916344221428 hartree
chargesum: -0.0000000
charge: -0.101521 -0.190447 -0.188032 -0.186880 -0.244930 -0.444227 -0.331059 -0.249171 -0.092609 0.069394 0.120448 -0.300266 -0.305364 0.350953 0.148273 0.398034 0.035827 -0.211578 0.014420 -0.081422 -0.151525 -0.163584 -0.279341 -0.168094 0.580484 0.234564 -0.232927 -0.134386 -0.170460 0.353340 -0.296824 -0.230477 -0.107217 -0.140075 -0.192760 0.056054 0.134178 0.082819 0.096766 0.103750 0.083408 0.100700 0.095473 0.160366 0.140873 0.145356 0.140645 0.145961 0.156504 0.148746 0.163503 0.158345 0.145229 0.147220 0.161011 0.161596 0.160935
qa: -0.1015 -0.1904 -0.1880 -0.1869 -0.2449 -0.4442 -0.3311 -0.2492 -0.0926 0.0694 0.1204 -0.3003 -0.3054 0.3510 0.1483 0.3980 0.0358 -0.2116 0.0144 -0.0814 -0.1515 -0.1636 -0.2793 -0.1681 0.5805 0.2346 -0.2329 -0.1344 -0.1705 0.3533 -0.2968 -0.2305 -0.1072 -0.1401 -0.1928 0.0561 0.1342 0.0828 0.0968 0.1038 0.0834 0.1007 0.0955 0.1604 0.1409 0.1454 0.1406 0.1460 0.1565 0.1487 0.1635 0.1583 0.1452 0.1472 0.1610 0.1616 0.1609
va: 1.2274 1.0939 1.1095 1.1136 2.1814 2.0624 2.0310 3.2081 3.1083 3.8126 3.8973 3.9511 3.9409 4.1967 3.8617 3.7529 3.8451 3.8959 3.7118 3.5919 3.9605 4.0246 4.0164 3.9299 4.3989 3.8282 4.0497 3.8985 3.9244 3.4765 4.0107 3.8765 3.8645 3.9045 3.9100 1.0309 0.9994 1.0034 1.0109 1.0016 1.0124 1.0032 1.0037 1.0379 1.0110 1.0054 1.0107 1.0082 1.0122 1.0010 0.9895 0.9957 1.0126 1.0110 0.9876 0.9890 0.9891
dispcorr: -0.038925291 hartree
energy: -2099.158416687566
dipole: 29.66325 -28.51163 1.15161 1.47957 -1.11304 0.36653 -19.04588 15.79266 -3.25322
magnitude: 3.47045 au
magnitude: 8.82118 debye
