program: Orca
programVersion: 5.0.2
elementType: Cl F F F O O O N N C C C C C C C C C C C C C C C C C C C C C C C C C C H H H H H H H H H H H H H H H H H H H H H H
charge: 0
multiplicity: 1
keywords: wb97x-d3
keywords: def2-TZVPP
keywords: def2/J RIJCOSX
keywords: DEFGRID2
keywords: scfconv7
keywords: smallprint printgap noloewdin
keywords: NOSOSCF
formula: C26H22ClF3N2O3
InChI: InChI=1/C26H22ClF3N2O3/c1-16(2)24(32-22-12-11-18(14-21(22)27)26(28,29)30)25(33)35-23(15-31)17-7-6-10-20(13-17)34-19-8-4-3-5-9-19/h3-14,16,23-24,32H,1-2H3
57 atoms
Cl 1.116556 3.640803 -1.829194
F  -4.045087 1.050233 0.687887
F  -3.971701 2.949329 -0.319138
F  -3.709442 1.138198 -1.4362
O  2.863856 -0.1463 -0.545221
O  3.296454 -1.095935 1.428038
O  -1.904585 -1.789436 -0.86705
N  2.195444 2.190119 0.532253
N  5.192499 -2.594758 -0.905105
C  4.40502 1.8238 1.575847
C  2.972521 1.294011 1.341971
C  5.25333 1.891326 0.309647
C  4.362486 3.173322 2.281248
C  3.049974 -0.115007 0.776973
C  0.85571 2.020956 0.333859
C  2.875608 -1.415415 -1.1866
C  0.193092 2.673361 -0.723107
C  0.058695 1.234833 1.176681
C  1.681745 -2.258161 -0.802122
C  -1.936699 1.807401 -0.042099
C  -1.167152 2.574576 -0.911238
C  -1.309014 1.137834 0.998127
C  0.427728 -1.680011 -0.962847
C  1.798146 -3.551981 -0.317421
C  -3.408063 1.73094 -0.268512
C  -0.707447 -2.404836 -0.639161
C  4.163688 -2.087238 -0.988839
C  0.650118 -4.271126 -0.013661
C  -0.605975 -3.710185 -0.169814
C  -2.984099 -2.045975 -0.059608
C  -4.221415 -2.144072 -0.677642
C  -2.868462 -2.137673 1.321532
C  -5.357363 -2.328837 0.097885
C  -4.011535 -2.331966 2.083087
C  -5.258312 -2.427723 1.478614
H  4.870841 1.105054 2.255039
H  2.51638 1.20149 2.330658
H  4.839871 2.571733 -0.437965
H  5.391659 0.916949 -0.160566
H  6.246552 2.265534 0.558501
H  3.744457 3.137639 3.179411
H  3.972454 3.959683 1.634424
H  5.368231 3.466988 2.582615
H  2.69789 2.635755 -0.220709
H  2.819281 -1.17605 -2.251274
H  0.503592 0.696759 2.002115
H  -1.62099 3.101456 -1.74109
H  -1.871861 0.530048 1.692883
H  0.322053 -0.671194 -1.344868
H  2.767435 -4.012508 -0.178181
H  0.735688 -5.285057 0.35289
H  -1.488942 -4.289191 0.06697
H  -4.29476 -2.07067 -1.75512
H  -1.903982 -2.052807 1.80606
H  -6.323115 -2.401547 -0.384519
H  -3.922507 -2.403227 3.159081
H  -6.14489 -2.577191 2.079943
elementType: Cl F O N C H
totalener: -2099.11839647 hartree
nucrepener: 4078.96575773 hartree
electener: -6178.08415420 hartree
twoeener: 4814.42157891 hartree
cpcmener: -0.04487259 hartree
kineticenergy: 2091.79111141 hartree
xcener: -173.916930819882 hartree
chargesum: -0.0000000
charge: -0.098354 -0.183475 -0.189217 -0.192538 -0.258780 -0.433677 -0.331504 -0.249802 -0.088980 0.065681 0.137981 -0.295842 -0.301884 0.324542 0.157593 0.452005 -0.004190 -0.171231 0.014025 -0.057176 -0.143725 -0.218165 -0.329230 -0.192855 0.588643 0.307558 -0.245825 -0.128729 -0.208493 0.344232 -0.298510 -0.231329 -0.103806 -0.136460 -0.194722 0.062164 0.134963 0.085758 0.090701 0.102086 0.096975 0.083212 0.100787 0.161430 0.148068 0.142592 0.127024 0.164192 0.146122 0.136442 0.164107 0.156969 0.145410 0.163859 0.160192 0.162256 0.160933
qa: -0.0984 -0.1835 -0.1892 -0.1925 -0.2588 -0.4337 -0.3315 -0.2498 -0.0890 0.0657 0.1380 -0.2958 -0.3019 0.3245 0.1576 0.4520 -0.0042 -0.1712 0.0140 -0.0572 -0.1437 -0.2182 -0.3292 -0.1929 0.5886 0.3076 -0.2458 -0.1287 -0.2085 0.3442 -0.2985 -0.2313 -0.1038 -0.1365 -0.1947 0.0622 0.1350 0.0858 0.0907 0.1021 0.0970 0.0832 0.1008 0.1614 0.1481 0.1426 0.1270 0.1642 0.1461 0.1364 0.1641 0.1570 0.1454 0.1639 0.1602 0.1623 0.1609
va: 1.2282 1.1179 1.1066 1.0943 2.1518 2.0793 2.0248 3.2112 3.0988 3.8093 3.8768 3.9545 3.9378 4.1752 3.8343 3.8572 3.8894 3.8680 3.7365 3.5997 4.1166 3.9650 4.0415 3.9237 4.3887 3.7354 4.0744 3.9279 3.9333 3.4710 4.0277 3.8888 3.8551 3.8944 3.9126 1.0269 1.0049 1.0031 1.0131 1.0031 1.0036 1.0112 1.0037 1.0382 0.9922 1.0134 1.0271 0.9958 1.0078 1.0159 0.9897 0.9969 1.0107 0.9965 0.9878 0.9892 0.9894
dispcorr: -0.038324536 hartree
energy: -2099.156721004405
dipole: 27.68128 -27.76549 -0.08421 -11.23872 11.79150 0.55278 17.81077 -17.33283 0.47794
magnitude: 0.73558 au
magnitude: 1.86970 debye
