program: Orca
programVersion: 5.0.2
elementType: Cl F F F O O O N N C C C C C C C C C C C C C C C C C C C C C C C C C C H H H H H H H H H H H H H H H H H H H H H H
charge: 0
multiplicity: 1
keywords: wb97x-d3
keywords: def2-TZVPP
keywords: def2/J RIJCOSX
keywords: DEFGRID2
keywords: scfconv7
keywords: smallprint printgap noloewdin
keywords: NOSOSCF
formula: C26H22ClF3N2O3
InChI: InChI=1/C26H22ClF3N2O3/c1-16(2)24(32-22-12-11-18(14-21(22)27)26(28,29)30)25(33)35-23(15-31)17-7-6-10-20(13-17)34-19-8-4-3-5-9-19/h3-14,16,23-24,32H,1-2H3
57 atoms
Cl 1.444358 3.383897 -2.530225
F  -3.948313 3.301301 -1.232351
F  -3.558238 1.655582 -2.551497
F  -4.126348 1.28453 -0.507253
O  2.783619 -0.437802 -0.501887
O  2.019734 -0.981792 1.527171
O  -2.255968 -2.947272 0.204169
N  2.118952 2.169359 0.101732
N  3.305463 -3.752754 0.200437
C  4.213076 1.58503 1.229077
C  2.705385 1.302843 1.095983
C  4.441544 3.008048 1.723606
C  4.880886 0.583817 2.164747
C  2.456148 -0.160893 0.764414
C  0.790986 2.123225 -0.217571
C  2.349776 -1.674107 -1.063827
C  0.313174 2.682819 -1.416983
C  -0.169663 1.5567 0.631081
C  0.85181 -1.675835 -1.248218
C  -1.951209 2.097253 -0.893984
C  -1.022198 2.674715 -1.752592
C  -1.511527 1.543308 0.298898
C  0.000683 -2.38437 -0.414404
C  0.336616 -0.870392 -2.260546
C  -3.388235 2.080939 -1.288294
C  -1.372722 -2.257286 -0.583089
C  2.861592 -2.82492 -0.314671
C  -1.033466 -0.775016 -2.430377
C  -1.89727 -1.456801 -1.584969
C  -2.034106 -3.035429 1.556949
C  -2.392359 -4.225564 2.173837
C  -1.527596 -1.973632 2.298058
C  -2.245374 -4.352091 3.54788
C  -1.376949 -2.119464 3.669931
C  -1.732718 -3.304213 4.301065
H  4.66337 1.483232 0.235308
H  2.244165 1.480898 2.071382
H  5.510332 3.205156 1.811188
H  3.994741 3.156376 2.708751
H  4.027329 3.756738 1.049444
H  4.407566 0.581086 3.148364
H  5.928227 0.851309 2.304131
H  4.865931 -0.436264 1.778341
H  2.745123 2.417997 -0.650834
H  2.837115 -1.709227 -2.040688
H  0.12314 1.126481 1.578512
H  -1.327339 3.109869 -2.695798
H  -2.202867 1.084551 0.992528
H  0.392566 -3.026795 0.364719
H  1.003862 -0.31873 -2.911422
H  -1.435601 -0.152283 -3.217698
H  -2.969669 -1.371109 -1.704355
H  -2.786703 -5.043071 1.58312
H  -1.256165 -1.039569 1.821585
H  -2.527834 -5.280181 4.027499
H  -0.981943 -1.293619 4.247436
H  -1.613904 -3.408748 5.37121
elementType: Cl F O N C H
totalener: -2099.11727047 hartree
nucrepener: 4118.23530175 hartree
electener: -6217.35257221 hartree
twoeener: 4853.23643176 hartree
cpcmener: -0.04482581 hartree
kineticenergy: 2091.77004655 hartree
xcener: -173.912461791461 hartree
chargesum: 0.0000000
charge: -0.097223 -0.187924 -0.189846 -0.186659 -0.264689 -0.424676 -0.342422 -0.222437 -0.092798 0.063328 0.119964 -0.297098 -0.301644 0.334327 0.165023 0.428816 0.010132 -0.192629 0.041692 -0.058768 -0.151023 -0.189853 -0.184766 -0.295768 0.576681 0.278500 -0.236898 -0.057874 -0.259019 0.264886 -0.226793 -0.140238 -0.142889 -0.195594 -0.165238 0.062073 0.123963 0.097353 0.088966 0.093095 0.097891 0.095287 0.093017 0.152800 0.148471 0.146592 0.122961 0.150317 0.140512 0.140643 0.154585 0.141830 0.148284 0.140611 0.161506 0.159532 0.161128
qa: -0.0972 -0.1879 -0.1898 -0.1867 -0.2647 -0.4247 -0.3424 -0.2224 -0.0928 0.0633 0.1200 -0.2971 -0.3016 0.3343 0.1650 0.4288 0.0101 -0.1926 0.0417 -0.0588 -0.1510 -0.1899 -0.1848 -0.2958 0.5767 0.2785 -0.2369 -0.0579 -0.2590 0.2649 -0.2268 -0.1402 -0.1429 -0.1956 -0.1652 0.0621 0.1240 0.0974 0.0890 0.0931 0.0979 0.0953 0.0930 0.1528 0.1485 0.1466 0.1230 0.1503 0.1405 0.1406 0.1546 0.1418 0.1483 0.1406 0.1615 0.1595 0.1611
va: 1.2300 1.1035 1.1011 1.1129 2.1555 2.0628 2.0704 3.2061 3.1012 3.8053 3.8502 3.9393 3.9550 4.0939 3.8599 3.8983 3.8401 3.8462 3.5391 3.5843 4.0729 3.9472 3.9223 3.9951 4.3908 3.7487 4.0593 3.7816 3.9781 3.6813 3.9774 3.8289 3.8958 3.9453 3.8768 1.0263 1.0065 1.0045 1.0012 1.0166 1.0044 1.0034 1.0081 1.0447 0.9942 1.0127 1.0292 1.0079 1.0184 1.0082 0.9969 1.0180 1.0072 0.9896 0.9879 0.9917 0.9888
dispcorr: -0.040215947 hartree
energy: -2099.157486414458
dipole: 32.85231 -31.29329 1.55902 -11.28235 13.14073 1.85838 28.08804 -28.53947 -0.45143
magnitude: 2.46737 au
magnitude: 6.27155 debye
