program: Orca
programVersion: 5.0.2
elementType: Cl F F F O O O N N C C C C C C C C C C C C C C C C C C C C C C C C C C H H H H H H H H H H H H H H H H H H H H H H
charge: 0
multiplicity: 1
keywords: wb97x-d3
keywords: def2-TZVPP
keywords: def2/J RIJCOSX
keywords: DEFGRID2
keywords: scfconv7
keywords: smallprint printgap noloewdin
keywords: NOSOSCF
formula: C26H22ClF3N2O3
InChI: InChI=1/C26H22ClF3N2O3/c1-16(2)24(32-22-12-11-18(14-21(22)27)26(28,29)30)25(33)35-23(15-31)17-7-6-10-20(13-17)34-19-8-4-3-5-9-19/h3-14,16,23-24,32H,1-2H3
57 atoms
Cl -0.452479 1.879059 -2.621074
F  -4.238104 1.457876 0.854785
F  -3.348133 0.412722 2.514648
F  -3.454637 2.555851 2.527387
O  3.259596 -0.491341 0.897167
O  3.647107 -0.424154 -1.300382
O  -1.556534 -1.953931 0.430585
N  1.854593 1.888552 -0.754316
N  3.37496 -2.707098 3.339392
C  4.241373 2.456904 -0.837132
C  3.142307 1.640346 -0.149038
C  3.935812 3.946382 -0.741758
C  5.596869 2.151414 -0.209983
C  3.40571 0.144701 -0.268069
C  0.647112 1.740537 -0.141102
C  3.268604 -1.916762 0.852268
C  -0.541626 1.759225 -0.891318
C  0.502199 1.611422 1.250325
C  2.01834 -2.470525 0.210042
C  -1.899642 1.566259 1.069356
C  -1.788667 1.680401 -0.307094
C  -0.741195 1.527928 1.839094
C  0.7805 -1.95905 0.580652
C  2.110757 -3.472767 -0.742837
C  -3.230477 1.496606 1.730992
C  -0.36629 -2.460749 -0.010062
C  3.338542 -2.33792 2.251005
C  0.949885 -3.976461 -1.314564
C  -0.292003 -3.47888 -0.954977
C  -2.564999 -1.669151 -0.452441
C  -2.326975 -1.222592 -1.74613
C  -3.859941 -1.779069 0.033515
C  -3.404462 -0.882847 -2.551912
C  -4.925738 -1.424367 -0.779781
C  -4.705369 -0.978279 -2.075834
H  4.269585 2.171234 -1.894108
H  3.119736 1.929349 0.90221
H  3.852931 4.264662 0.299645
H  3.010495 4.214539 -1.249589
H  4.738627 4.523774 -1.201429
H  6.375665 2.7426 -0.691928
H  5.885678 1.103835 -0.309044
H  5.602136 2.402079 0.852791
H  1.859906 1.870779 -1.764098
H  4.161621 -2.292003 0.342883
H  1.373304 1.572541 1.888004
H  -2.662676 1.707491 -0.942606
H  -0.793513 1.431763 2.91634
H  0.696851 -1.177826 1.326671
H  3.077975 -3.860894 -1.034443
H  1.010815 -4.765274 -2.052069
H  -1.188575 -3.883021 -1.407069
H  -1.31885 -1.11953 -2.125937
H  -4.030326 -2.127496 1.044138
H  -3.21875 -0.531066 -3.558222
H  -5.934233 -1.503044 -0.395501
H  -5.539449 -0.70562 -2.708214
elementType: Cl F O N C H
totalener: -2099.11648272 hartree
nucrepener: 4133.28046098 hartree
electener: -6232.39694371 hartree
twoeener: 4868.93385121 hartree
cpcmener: -0.04273040 hartree
kineticenergy: 2091.80686750 hartree
xcener: -173.917481844907 hartree
chargesum: 0.0000000
charge: -0.100503 -0.184664 -0.192581 -0.190016 -0.264684 -0.444975 -0.334744 -0.187204 -0.097833 0.075211 0.092494 -0.300311 -0.296583 0.329443 0.216445 0.405854 -0.048361 -0.264427 0.028791 -0.110481 -0.072183 -0.156783 -0.283743 -0.194761 0.578627 0.257162 -0.222651 -0.121597 -0.188947 0.326840 -0.181015 -0.269744 -0.184944 -0.128478 -0.166728 0.055925 0.115396 0.088111 0.091062 0.098815 0.095862 0.096402 0.092908 0.154772 0.148982 0.142093 0.133531 0.146592 0.177885 0.149310 0.163846 0.157303 0.151743 0.141675 0.156134 0.159383 0.160344
qa: -0.1005 -0.1847 -0.1926 -0.1900 -0.2647 -0.4450 -0.3347 -0.1872 -0.0978 0.0752 0.0925 -0.3003 -0.2966 0.3294 0.2164 0.4059 -0.0484 -0.2644 0.0288 -0.1105 -0.0722 -0.1568 -0.2837 -0.1948 0.5786 0.2572 -0.2227 -0.1216 -0.1889 0.3268 -0.1810 -0.2697 -0.1849 -0.1285 -0.1667 0.0559 0.1154 0.0881 0.0911 0.0988 0.0959 0.0964 0.0929 0.1548 0.1490 0.1421 0.1335 0.1466 0.1779 0.1493 0.1638 0.1573 0.1517 0.1417 0.1561 0.1594 0.1603
va: 1.2337 1.1128 1.0946 1.1031 2.1406 2.0559 2.0364 3.1780 3.1086 3.8103 3.8704 3.9417 3.9467 4.1654 3.7903 3.7234 3.8458 3.8895 3.6172 3.5919 3.8756 4.0408 4.0169 3.9708 4.3970 3.7982 4.0947 3.8859 3.9348 3.5320 3.7999 3.9528 3.9062 3.8583 3.8897 1.0321 1.0175 1.0020 1.0175 1.0039 1.0027 1.0116 1.0027 1.0490 1.0129 1.0121 1.0215 1.0071 0.9975 1.0016 0.9886 0.9960 1.0032 1.0165 0.9955 0.9883 0.9884
dispcorr: -0.039784161 hartree
energy: -2099.156266883171
dipole: 33.88354 -32.25154 1.63201 0.75345 -0.13721 0.61624 -12.68739 10.80717 -1.88022
magnitude: 2.56484 au
magnitude: 6.51932 debye
