program: Gaussian 09
title: 000074748
version: EM64L-G09RevD.01
frameworkgroup: C1[X(C11H16ClOPS2)]
method: RPBEPBE
basis: SDD
operation: Freq
keyword: #p
keyword: freq=noraman
keyword: PBEPBE/SDD
title: #p freq=noraman PBEPBE/SDD
converged: NO YES NO NO
title: Mulliken charges:
elementType: Cl S S P O C C C C C C C C C C C H H H H H H H H H H H H H H H H
charge: -0.051447 -0.006943 -0.208406 0.456793 -0.449696 -0.623027 -0.177193 -0.618328 -0.214435 -0.392150 0.558760 -0.204833 -0.284197 -0.195890 -0.656033 -0.794254 0.287821 0.255519 0.229665 0.235494 0.248948 0.202133 0.225777 0.253071 0.268457 0.259617 0.205730 0.235594 0.234081 0.246347 0.249779 0.223244
chargesum: 0.00000
title: Mulliken charges with hydrogens summed into heavy atoms:
elementType: Cl S S P O C C C C C C C C C C C
charge: -0.051447 -0.006943 -0.208406 0.456793 -0.449696 -0.079687 -0.177193 0.095779 0.213476 -0.139079 0.558760 0.063624 -0.284197 0.063727 0.019372 -0.074883
polarizability: 2.82939765e+02 1.73044998e+00 1.92410504e+02 -1.23335768e+01 1.33785502e+01 1.47145085e+02
1716.lowfreq: -8.8622 -4.2621 -0.0025 -0.0005 0.0022 6.6846 11.3446 14.1680 31.0993
frequency: 5.5271 13.9808 30.8460 37.7485 54.0349 78.0436 89.6660 104.0858 110.3124 122.2682 142.5284 171.2696 184.7610 202.7031 215.0748 234.0321 239.1118 249.3272 255.7595 292.9822 313.8931 334.4495 348.9158 416.8827 429.6439 436.3656 499.9314 536.6014 546.6326 548.7526 637.5765 672.0249 684.9570 701.9312 778.4787 812.5791 814.1006 852.5233 869.3968 891.0201 946.8684 991.1429 993.8802 1014.6526 1020.8327 1040.5901 1047.6398 1050.5985 1082.2457 1102.2299 1125.5405 1141.6122 1212.6506 1240.4689 1252.8593 1262.4260 1272.6779 1348.5722 1366.4759 1371.9980 1392.8960 1397.1916 1402.5481 1425.2639 1447.7948 1456.1892 1460.6212 1466.1247 1473.3535 1476.0021 1482.3529 1487.4442 1560.8227 1591.6907 2956.4563 2986.9027 2991.6619 2994.7909 3017.6847 3021.7690 3067.1231 3081.9582 3089.4754 3091.9869 3097.5970 3105.1368 3109.3558 3147.4431 3163.1813 3183.1756
redmass: 4.9918 3.3899 3.7547 4.5534 2.3623 3.2156 4.5775 3.7281 1.1859 4.8237 6.2301 1.7086 3.3989 4.2062 7.1250 1.6105 3.0044 2.6647 2.0116 4.1836 12.0497 9.4217 4.0835 3.9564 6.0441 2.8949 5.9813 7.1245 5.3235 4.5256 5.6942 6.1170 6.8447 3.6168 1.2344 1.0981 1.3410 5.6837 3.7630 1.3712 1.3585 1.7261 1.6506 2.5746 4.3971 1.2994 1.5251 2.3036 2.0978 2.1904 1.4241 1.4013 2.4891 1.2022 1.1532 1.2795 1.3042 1.2601 9.2149 3.0534 1.2336 1.1798 1.2293 1.0809 2.4701 1.0399 1.0455 1.0370 1.1593 1.0568 1.0486 1.0738 5.9500 7.7729 1.0564 1.0369 1.0354 1.0363 1.0613 1.1045 1.0973 1.1015 1.0995 1.0983 1.0998 1.1020 1.1016 1.0922 1.0889 1.0978
irintensity: 0.6612 0.3178 0.3941 0.6353 2.4497 1.5601 0.1636 2.8521 1.5017 0.5239 0.0822 0.7844 4.8254 12.8093 8.4077 0.6292 1.6028 4.0467 2.7629 2.3306 1.7346 4.6221 0.9958 1.6543 70.3261 4.5598 5.3880 49.5001 8.7328 11.8433 61.8941 30.0515 4.9029 0.9103 23.8295 2.6788 29.8802 2.1033 127.0564 10.8382 0.9731 14.5679 1.3982 126.6343 107.5109 3.2443 8.2126 35.6736 0.9966 9.7674 7.8273 2.7616 1.0481 2.3716 2.2737 1.3420 2.2098 8.1209 3.7719 9.4945 20.5376 20.3154 16.0111 9.8410 52.2630 11.1915 13.4149 16.7985 30.6053 3.2695 15.5357 2.6583 11.7493 3.8444 49.4655 19.7154 30.6964 26.9650 7.9098 18.2824 11.9077 3.1283 13.9164 25.7134 14.9982 17.6442 28.6618 4.0804 1.2948 1.0781
temp: 298.150 k
press: 1.00000 atm
elementType: 17 16 16 15 8 6 6 6 6 6 6 6 6 6 6 6 1 1 1 1 1 1 1 1 1 1 1 1 1 1 1 1
symmnumber: 1
zpe: 642829.4 jmol-1
zpe.correction: 0.244841 hartree
zpe.thermalcorrener: 0.265361 hartree
zpe.thermalcorrenthalpy: 0.266305 hartree
zpe.thermalcorrgfe: 0.190515 hartree
zpe.sumelectzpe: -2100.188128 hartree
zpe.sumelectthermal: -2100.167608 hartree
zpe.sumelectthermalent: -2100.166664 hartree
zpe.sumelectthermalfe: -2100.242453 hartree
dipole: -3.2691 2.5881 2.6115
dipole: 4.9199
quadrupole: -113.4412 -115.2297 -135.2646
quadrupole: -0.1708 -5.2508 -3.0983
quadrupole: 7.8706 6.0821 -13.9528 -0.1708 -5.2508 -3.0983
hfenergy: -2100.4329684 hartree
pointgroup: C01 [X(C11H16Cl1O1P1S2)]
dipole: -1.2518864 -0.8685342 -1.1937587 debye
polarizability: 282.7951223|-1.5682707|186.7755618|12.8384926|20.2220674|152.9246698 unknown
InChI: InChI=1S/C7H6ClS.C4H10OPS/c1-5-4-6(9)2-3-7(5)8;1-3-5-6(7)4-2/h2-4H,1H3;3-4H2,1-2H3
charge 0 multiplicity 1
32 atoms
Cl 5.100484 0.518691 0.946645
S  -0.799068 0.424265 -1.657516
S  -1.455038 1.651604 1.867878
P  -2.160883 0.544436 0.281472
O  -2.463721 -1.118073 0.771696
C  -3.773416 1.128153 -0.505352
C  0.857791 0.446828 -0.873031
C  -4.941577 1.098184 0.497871
C  -2.839398 -2.12874 -0.254306
C  1.588319 -0.758583 -0.750304
C  2.894237 -0.779831 -0.199228
C  1.413251 1.66985 -0.431275
C  3.420901 0.466323 0.225947
C  2.710901 1.676808 0.125116
C  -2.744873 -3.487877 0.435514
C  3.669097 -2.07418 -0.071641
H  -3.573871 2.150047 -0.871546
H  -3.962616 0.481129 -1.381444
H  -5.865309 1.448293 0.00284
H  -5.119673 0.079621 0.885003
H  -4.738525 1.757003 1.359831
H  -3.872062 -1.928958 -0.608215
H  -2.143043 -2.051918 -1.11303
H  1.137427 -1.698745 -1.084987
H  0.842933 2.598409 -0.514508
H  3.158827 2.610038 0.47725
H  -3.027941 -4.291599 -0.269577
H  -1.715806 -3.670711 0.787631
H  -3.420997 -3.53035 1.306087
H  4.622813 -2.026968 -0.628563
H  3.928202 -2.280145 0.982941
H  3.082335 -2.924003 -0.4577
