program: Orca
programVersion: 5.0.2
elementType: Cl F F F O O O N N C C C C C C C C C C C C C C C C C C C C C C C C C C H H H H H H H H H H H H H H H H H H H H H H
charge: 0
multiplicity: 1
keywords: wb97x-d3
keywords: def2-TZVPP
keywords: def2/J RIJCOSX
keywords: DEFGRID2
keywords: scfconv7
keywords: smallprint printgap noloewdin
keywords: NOSOSCF
formula: C26H22ClF3N2O3
InChI: InChI=1/C26H22ClF3N2O3/c1-16(2)24(32-22-12-11-18(14-21(22)27)26(28,29)30)25(33)35-23(15-31)17-7-6-10-20(13-17)34-19-8-4-3-5-9-19/h3-14,16,23-24,32H,1-2H3
57 atoms
Cl -0.491506 1.413997 -2.343114
F  -2.911887 0.315361 2.833565
F  -3.015493 2.419448 3.246281
F  -4.009167 1.614371 1.518118
O  2.58496 -0.313836 0.087736
O  3.71488 0.549443 1.808792
O  -1.256814 -2.657242 -2.311818
N  1.89942 2.161229 -0.722942
N  0.897394 -1.19055 2.897834
C  4.300145 1.963142 -1.153358
C  3.184751 1.965806 -0.09085
C  4.32745 3.296717 -1.891644
C  5.662279 1.675336 -0.532407
C  3.212264 0.678745 0.723666
C  0.739128 2.031187 -0.007904
C  2.39637 -1.541292 0.778819
C  -0.471679 1.684098 -0.628986
C  0.693133 2.255243 1.374924
C  1.705352 -2.490106 -0.165121
C  -1.657026 1.743275 1.451581
C  -1.647058 1.533816 0.078475
C  -0.477458 2.106658 2.089814
C  0.505713 -2.111563 -0.758339
C  2.282272 -3.719021 -0.445474
C  -2.895501 1.528079 2.252743
C  -0.113103 -2.985719 -1.637964
C  1.56632 -1.320217 1.970771
C  1.649923 -4.581726 -1.330308
C  0.452017 -4.22299 -1.924346
C  -2.294618 -2.017654 -1.680464
C  -2.626881 -2.252619 -0.351949
C  -3.063354 -1.168771 -2.464393
C  -3.742882 -1.626311 0.185843
C  -4.183329 -0.561603 -1.916256
C  -4.528914 -0.785887 -0.590611
H  4.072011 1.169125 -1.873001
H  3.392198 2.778191 0.611158
H  4.523503 4.120782 -1.202714
H  3.394745 3.507573 -2.41332
H  5.122845 3.290705 -2.637486
H  5.893612 2.383912 0.264975
H  6.438441 1.769108 -1.291955
H  5.740465 0.667262 -0.124731
H  1.858821 1.804332 -1.667654
H  3.351307 -1.961075 1.107688
H  1.58251 2.564045 1.906669
H  -2.545132 1.250571 -0.455093
H  -0.45246 2.284894 3.156615
H  0.062409 -1.147994 -0.533641
H  3.218379 -3.99965 0.019368
H  2.091383 -5.542945 -1.555454
H  -0.043655 -4.894007 -2.613929
H  -2.038516 -2.922271 0.262348
H  -2.789859 -0.992975 -3.496795
H  -4.005414 -1.81598 1.21791
H  -4.783647 0.096232 -2.530917
H  -5.404008 -0.311725 -0.16804
elementType: Cl F O N C H
totalener: -2099.11915002 hartree
nucrepener: 4154.80734912 hartree
electener: -6253.92649914 hartree
twoeener: 4890.92501265 hartree
cpcmener: -0.04327871 hartree
kineticenergy: 2091.78350249 hartree
xcener: -173.911735746898 hartree
chargesum: 0.0000000
charge: -0.096895 -0.187830 -0.186093 -0.183662 -0.261009 -0.422223 -0.332811 -0.234726 -0.094643 0.056683 0.117622 -0.295418 -0.302787 0.323974 0.141322 0.439450 0.002990 -0.200631 -0.015623 -0.065857 -0.109952 -0.204650 -0.177319 -0.188947 0.563751 0.257534 -0.242337 -0.114748 -0.232397 0.325467 -0.179448 -0.297222 -0.162243 -0.088208 -0.194000 0.062349 0.122808 0.090332 0.093101 0.096856 0.096494 0.095319 0.094317 0.154055 0.136010 0.151826 0.159129 0.147905 0.116772 0.150140 0.162884 0.149686 0.152399 0.144117 0.156250 0.157420 0.152719
qa: -0.0969 -0.1878 -0.1861 -0.1837 -0.2610 -0.4222 -0.3328 -0.2347 -0.0946 0.0567 0.1176 -0.2954 -0.3028 0.3240 0.1413 0.4395 0.0030 -0.2006 -0.0156 -0.0659 -0.1100 -0.2046 -0.1773 -0.1889 0.5638 0.2575 -0.2423 -0.1147 -0.2324 0.3255 -0.1794 -0.2972 -0.1622 -0.0882 -0.1940 0.0623 0.1228 0.0903 0.0931 0.0969 0.0965 0.0953 0.0943 0.1541 0.1360 0.1518 0.1591 0.1479 0.1168 0.1501 0.1629 0.1497 0.1524 0.1441 0.1562 0.1574 0.1527
va: 1.2322 1.0941 1.1135 1.1144 2.1856 2.0704 2.0757 3.1984 3.0945 3.8198 3.8462 3.9388 3.9457 4.1458 3.8697 3.7244 3.9178 3.8982 3.7577 3.6644 3.9081 4.0198 3.9455 3.9286 4.4136 3.7433 4.0229 3.8906 4.0016 3.6103 3.8670 3.9631 3.8305 3.8209 3.8498 1.0260 1.0057 1.0011 1.0154 1.0047 1.0044 1.0034 1.0083 1.0429 1.0150 1.0103 1.0026 1.0100 1.0304 1.0007 0.9881 1.0046 0.9996 1.0131 1.0002 0.9887 0.9981
dispcorr: -0.040040537 hartree
energy: -2099.159190552022
dipole: 36.78641 -34.32354 2.46287 -2.26356 1.91431 -0.34925 -16.74135 14.30772 -2.43363
magnitude: 3.47998 au
magnitude: 8.84540 debye
