program: Orca
programVersion: 5.0.2
elementType: Cl F F F O O O N N C C C C C C C C C C C C C C C C C C C C C C C C C C H H H H H H H H H H H H H H H H H H H H H H
charge: 0
multiplicity: 1
keywords: wb97x-d3
keywords: def2-TZVPP
keywords: def2/J RIJCOSX
keywords: DEFGRID2
keywords: scfconv7
keywords: smallprint printgap noloewdin
keywords: NOSOSCF
formula: C26H22ClF3N2O3
InChI: InChI=1/C26H22ClF3N2O3/c1-16(2)24(32-22-12-11-18(14-21(22)27)26(28,29)30)25(33)35-23(15-31)17-7-6-10-20(13-17)34-19-8-4-3-5-9-19/h3-14,16,23-24,32H,1-2H3
57 atoms
Cl -0.452708 1.580084 -2.24102
F  -3.057021 0.490393 2.940317
F  -3.080412 2.613126 3.249577
F  -4.050537 1.770379 1.526474
O  2.516657 -0.329649 0.214231
O  3.955931 0.356896 1.777405
O  -1.21623 -2.634511 -2.35407
N  1.926936 2.142494 -0.537923
N  0.949532 -1.410793 2.977279
C  4.373118 2.09688 -0.876172
C  3.196078 1.935449 0.108068
C  4.407525 1.047918 -1.983532
C  4.387604 3.506366 -1.454914
C  3.282153 0.586758 0.80874
C  0.752745 2.010466 0.148391
C  2.404962 -1.614228 0.809727
C  -0.460625 1.765996 -0.515671
C  0.689162 2.132616 1.544487
C  1.735617 -2.521669 -0.189056
C  -1.694216 1.79655 1.537441
C  -1.661669 1.658916 0.155975
C  -0.506781 2.025267 2.22276
C  0.531195 -2.133603 -0.766019
C  2.341337 -3.718769 -0.538388
C  -2.966951 1.670219 2.302273
C  -0.065803 -2.96887 -1.69726
C  1.596462 -1.493129 2.029578
C  1.732035 -4.540681 -1.476771
C  0.528784 -4.174196 -2.054088
C  -2.235573 -1.973558 -1.713556
C  -2.586458 -2.235021 -0.394711
C  -2.966272 -1.07504 -2.477594
C  -3.682587 -1.583982 0.154501
C  -4.070454 -0.44677 -1.920587
C  -4.434099 -0.696747 -0.604287
H  5.274408 1.973955 -0.269622
H  3.341944 2.687037 0.888516
H  3.524603 1.078553 -2.625312
H  4.509819 0.031983 -1.601033
H  5.268659 1.232651 -2.626432
H  3.546523 3.679602 -2.127508
H  5.301986 3.663956 -2.027829
H  4.353782 4.26262 -0.669159
H  1.894669 1.872366 -1.509987
H  3.383205 -2.015975 1.087419
H  1.58397 2.331565 2.117994
H  -2.561753 1.466601 -0.412842
H  -0.498148 2.132587 3.299481
H  0.068886 -1.192345 -0.490381
H  3.282383 -4.005422 -0.087434
H  2.196668 -5.475895 -1.757935
H  0.051227 -4.813485 -2.785238
H  -2.026465 -2.943112 0.202802
H  -2.677199 -0.878858 -3.502105
H  -3.957431 -1.791132 1.180385
H  -4.64314 0.247981 -2.520715
H  -5.296614 -0.205786 -0.174766
elementType: Cl F O N C H
totalener: -2099.11911565 hartree
nucrepener: 4150.14200074 hartree
electener: -6249.26111639 hartree
twoeener: 4886.03892839 hartree
cpcmener: -0.04278753 hartree
kineticenergy: 2091.79083408 hartree
xcener: -173.913738205328 hartree
chargesum: -0.0000000
charge: -0.100340 -0.189434 -0.187780 -0.183878 -0.253873 -0.430010 -0.332666 -0.253623 -0.092933 0.059781 0.131140 -0.294138 -0.299125 0.319361 0.159488 0.405082 0.010386 -0.217653 0.010473 -0.063818 -0.131954 -0.188707 -0.199090 -0.201436 0.567407 0.279051 -0.225379 -0.106701 -0.245479 0.326176 -0.181862 -0.290561 -0.159398 -0.099166 -0.193068 0.061291 0.131736 0.084612 0.088849 0.101967 0.084872 0.100433 0.096705 0.163407 0.133278 0.147151 0.157499 0.148465 0.123160 0.150199 0.162948 0.149783 0.154291 0.144267 0.157317 0.158353 0.153144
qa: -0.1003 -0.1894 -0.1878 -0.1839 -0.2539 -0.4300 -0.3327 -0.2536 -0.0929 0.0598 0.1311 -0.2941 -0.2991 0.3194 0.1595 0.4051 0.0104 -0.2177 0.0105 -0.0638 -0.1320 -0.1887 -0.1991 -0.2014 0.5674 0.2791 -0.2254 -0.1067 -0.2455 0.3262 -0.1819 -0.2906 -0.1594 -0.0992 -0.1931 0.0613 0.1317 0.0846 0.0888 0.1020 0.0849 0.1004 0.0967 0.1634 0.1333 0.1472 0.1575 0.1485 0.1232 0.1502 0.1629 0.1498 0.1543 0.1443 0.1573 0.1584 0.1531
va: 1.2262 1.0943 1.1104 1.1147 2.1695 2.0782 2.0788 3.2107 3.0931 3.8220 3.8358 3.9520 3.9402 4.1842 3.8425 3.7502 3.8960 3.8969 3.7208 3.6644 3.9310 4.0301 3.9536 3.9386 4.4100 3.7277 4.0318 3.8840 4.0081 3.6153 3.8743 3.9579 3.8313 3.8163 3.8391 1.0234 1.0041 1.0051 1.0151 1.0032 1.0092 1.0035 1.0039 1.0373 1.0227 1.0112 1.0075 1.0087 1.0283 1.0004 0.9880 1.0052 0.9984 1.0123 0.9980 0.9886 0.9986
dispcorr: -0.039954849 hartree
energy: -2099.159070502345
dipole: 34.57563 -32.19042 2.38521 -3.96994 3.77646 -0.19347 -19.42537 17.03563 -2.38974
magnitude: 3.38194 au
magnitude: 8.59621 debye
