program: Orca
programVersion: 5.0.2
elementType: Cl F F F O O O N N C C C C C C C C C C C C C C C C C C C C C C C C C C H H H H H H H H H H H H H H H H H H H H H H
charge: 0
multiplicity: 1
keywords: wb97x-d3
keywords: def2-TZVPP
keywords: def2/J RIJCOSX
keywords: DEFGRID2
keywords: scfconv7
keywords: smallprint printgap noloewdin
keywords: NOSOSCF
formula: C26H22ClF3N2O3
InChI: InChI=1/C26H22ClF3N2O3/c1-16(2)24(32-22-12-11-18(14-21(22)27)26(28,29)30)25(33)35-23(15-31)17-7-6-10-20(13-17)34-19-8-4-3-5-9-19/h3-14,16,23-24,32H,1-2H3
57 atoms
Cl -0.536117 1.903087 -2.593579
F  -4.24048 1.481669 0.975061
F  -3.319515 0.372212 2.576264
F  -3.392295 2.515488 2.656588
O  3.218645 -0.472012 0.892546
O  3.594607 -0.459216 -1.308319
O  -1.589308 -2.029202 0.412521
N  1.811434 1.880867 -0.783953
N  3.37495 -2.617799 3.392754
C  4.19831 2.424299 -0.939406
C  3.110663 1.635467 -0.203027
C  3.898384 3.917165 -0.890032
C  5.564832 2.137149 -0.3275
C  3.362064 0.135003 -0.288665
C  0.618916 1.733167 -0.143002
C  3.240877 -1.897946 0.885253
C  -0.586829 1.756249 -0.86503
C  0.508277 1.60123 1.251111
C  2.002041 -2.487662 0.252856
C  -1.895924 1.549812 1.126273
C  -1.819363 1.668436 -0.252186
C  -0.720117 1.514106 1.868911
C  0.752085 -1.985746 0.596422
C  2.118702 -3.516742 -0.668245
C  -3.207983 1.478268 1.822567
C  -0.378784 -2.525649 0.0099
C  3.32014 -2.280518 2.294467
C  0.972888 -4.059044 -1.234449
C  -0.279639 -3.57132 -0.90104
C  -2.530946 -1.667888 -0.51598
C  -3.852062 -1.688783 -0.089984
C  -2.205124 -1.237742 -1.795388
C  -4.853122 -1.264099 -0.949977
C  -3.220132 -0.82731 -2.648376
C  -4.544794 -0.835748 -2.233858
H  4.205673 2.103018 -1.986484
H  3.115251 1.952425 0.840373
H  3.830538 4.271511 0.140178
H  2.96744 4.171789 -1.393233
H  4.694926 4.476495 -1.379832
H  6.336105 2.707689 -0.845183
H  5.848961 1.085582 -0.394171
H  5.591147 2.425783 0.725321
H  1.794288 1.85448 -1.792884
H  4.140298 -2.275955 0.389297
H  1.393997 1.565148 1.868353
H  -2.709391 1.693633 -0.865597
H  -0.747481 1.416242 2.947026
H  0.646735 -1.182086 1.315352
H  3.095027 -3.896293 -0.940433
H  1.055825 -4.869319 -1.945877
H  -1.167558 -4.001196 -1.346396
H  -4.091414 -2.024754 0.910599
H  -1.176855 -1.200771 -2.130263
H  -5.881028 -1.27483 -0.611896
H  -2.965369 -0.489171 -3.64372
H  -5.329337 -0.510148 -2.903505
elementType: Cl F O N C H
totalener: -2099.11686245 hartree
nucrepener: 4136.03883047 hartree
electener: -6235.15569292 hartree
twoeener: 4871.62214831 hartree
cpcmener: -0.04270013 hartree
kineticenergy: 2091.81782754 hartree
xcener: -173.919643738492 hartree
chargesum: 0.0000000
charge: -0.099863 -0.183939 -0.192768 -0.190020 -0.264389 -0.444495 -0.335596 -0.188216 -0.098481 0.077670 0.091033 -0.299919 -0.296416 0.331142 0.224436 0.399272 -0.049801 -0.267836 0.024669 -0.111693 -0.073289 -0.156076 -0.275994 -0.188717 0.577298 0.245637 -0.221035 -0.120913 -0.180676 0.338345 -0.282413 -0.178839 -0.122792 -0.182985 -0.174803 0.055486 0.115631 0.088324 0.090369 0.098609 0.095787 0.096373 0.092779 0.155046 0.149600 0.140969 0.132783 0.146850 0.180103 0.149462 0.163928 0.157808 0.141054 0.148529 0.158983 0.154192 0.159796
qa: -0.0999 -0.1839 -0.1928 -0.1900 -0.2644 -0.4445 -0.3356 -0.1882 -0.0985 0.0777 0.0910 -0.2999 -0.2964 0.3311 0.2244 0.3993 -0.0498 -0.2678 0.0247 -0.1117 -0.0733 -0.1561 -0.2760 -0.1887 0.5773 0.2456 -0.2210 -0.1209 -0.1807 0.3383 -0.2824 -0.1788 -0.1228 -0.1830 -0.1748 0.0555 0.1156 0.0883 0.0904 0.0986 0.0958 0.0964 0.0928 0.1550 0.1496 0.1410 0.1328 0.1469 0.1801 0.1495 0.1639 0.1578 0.1411 0.1485 0.1590 0.1542 0.1598
va: 1.2351 1.1138 1.0952 1.1037 2.1423 2.0560 2.0378 3.1790 3.1087 3.8069 3.8732 3.9422 3.9464 4.1613 3.7840 3.7284 3.8614 3.8915 3.6193 3.5975 3.8733 4.0394 4.0223 3.9652 4.4010 3.8001 4.0929 3.8810 3.9391 3.5336 3.9543 3.7910 3.8548 3.8991 3.8875 1.0325 1.0168 1.0021 1.0180 1.0040 1.0027 1.0115 1.0028 1.0481 1.0125 1.0140 1.0210 1.0070 0.9945 1.0014 0.9885 0.9956 1.0177 1.0057 0.9884 0.9978 0.9889
dispcorr: -0.039888173 hartree
energy: -2099.156750623142
dipole: 34.19887 -32.47811 1.72077 0.81414 -0.22715 0.58699 -14.20355 12.23849 -1.96506
magnitude: 2.67713 au
magnitude: 6.80473 debye
