program: Orca
programVersion: 5.0.2
elementType: Cl F F F O O O N N C C C C C C C C C C C C C C C C C C C C C C C C C C H H H H H H H H H H H H H H H H H H H H H H
charge: 0
multiplicity: 1
keywords: wb97x-d3
keywords: def2-TZVPP
keywords: def2/J RIJCOSX
keywords: DEFGRID2
keywords: scfconv7
keywords: smallprint printgap noloewdin
keywords: NOSOSCF
formula: C26H22ClF3N2O3
InChI: InChI=1/C26H22ClF3N2O3/c1-16(2)24(32-22-12-11-18(14-21(22)27)26(28,29)30)25(33)35-23(15-31)17-7-6-10-20(13-17)34-19-8-4-3-5-9-19/h3-14,16,23-24,32H,1-2H3
57 atoms
Cl 1.616005 4.058084 -1.504803
F  -3.815433 3.746053 -0.747723
F  -3.393189 2.51168 -2.450233
F  -4.122435 1.619543 -0.631624
O  2.476314 -0.24417 -0.583559
O  2.133667 -1.404815 1.296725
O  -2.293091 -3.127588 -0.066718
N  2.062319 2.08064 0.675713
N  3.332956 -3.570145 -0.877022
C  3.99123 1.156598 1.910678
C  2.52947 0.968976 1.455439
C  4.998215 1.235353 0.767923
C  4.100406 2.374878 2.820366
C  2.350402 -0.363517 0.738898
C  0.771335 2.162484 0.244836
C  2.107731 -1.330375 -1.429469
C  0.398449 3.061439 -0.771674
C  -0.255689 1.383371 0.796638
C  0.606188 -1.438793 -1.529768
C  -1.899648 2.392543 -0.638739
C  -0.901968 3.176188 -1.208843
C  -1.563488 1.498749 0.366295
C  -0.124832 -2.312446 -0.736893
C  -0.040275 -0.569703 -2.402552
C  -3.301945 2.558872 -1.111668
C  -1.512884 -2.288134 -0.803129
C  2.774483 -2.583952 -1.064931
C  -1.423319 -0.578568 -2.478043
C  -2.166676 -1.425812 -1.671872
C  -1.907317 -3.513836 1.189578
C  -1.395016 -2.611495 2.114288
C  -2.108298 -4.843032 1.530724
C  -1.076718 -3.057774 3.388376
C  -1.797357 -5.272015 2.81314
C  -1.27605 -4.385134 3.744462
H  4.225583 0.269752 2.506254
H  1.934888 0.888279 2.369871
H  4.836692 2.10227 0.123255
H  4.999311 0.344409 0.139831
H  6.003959 1.335512 1.177614
H  5.103144 2.438797 3.244515
H  3.394101 2.320777 3.650239
H  3.913479 3.304641 2.280999
H  2.75246 2.541746 0.102946
H  2.510753 -1.051839 -2.40564
H  -0.044148 0.677675 1.587944
H  -1.130829 3.881042 -1.998238
H  -2.312025 0.872771 0.83234
H  0.375929 -3.009427 -0.077055
H  0.533513 0.107634 -3.022795
H  -1.929894 0.090054 -3.160568
H  -3.248312 -1.427068 -1.719203
H  -1.247494 -1.570704 1.852858
H  -2.510338 -5.532744 0.799174
H  -0.676085 -2.356574 4.108923
H  -1.958546 -6.308573 3.079569
H  -1.028759 -4.724355 4.74167
elementType: Cl F O N C H
totalener: -2099.12968239 hartree
nucrepener: 4082.98051465 hartree
electener: -6182.11019704 hartree
twoeener: 4817.81480051 hartree
cpcmener: -0.03859385 hartree
kineticenergy: 2091.81346117 hartree
xcener: -173.919784534455 hartree
chargesum: 0.0000000
charge: -0.096961 -0.186902 -0.189847 -0.184883 -0.259365 -0.409465 -0.324958 -0.247810 -0.079159 0.056804 0.145818 -0.297926 -0.293613 0.308567 0.175857 0.400359 -0.006523 -0.200992 0.026050 -0.079475 -0.124706 -0.175023 -0.178821 -0.268066 0.571292 0.275653 -0.236146 -0.082540 -0.249288 0.265773 -0.161520 -0.223855 -0.177321 -0.134819 -0.162565 0.060816 0.129650 0.083003 0.091485 0.102426 0.099246 0.095374 0.083803 0.159685 0.142026 0.142749 0.123072 0.150822 0.142554 0.141001 0.150808 0.143282 0.150144 0.144760 0.154889 0.157363 0.157415
qa: -0.0970 -0.1869 -0.1898 -0.1849 -0.2594 -0.4095 -0.3250 -0.2478 -0.0792 0.0568 0.1458 -0.2979 -0.2936 0.3086 0.1759 0.4004 -0.0065 -0.2010 0.0261 -0.0795 -0.1247 -0.1750 -0.1788 -0.2681 0.5713 0.2757 -0.2361 -0.0825 -0.2493 0.2658 -0.1615 -0.2239 -0.1773 -0.1348 -0.1626 0.0608 0.1297 0.0830 0.0915 0.1024 0.0992 0.0954 0.0838 0.1597 0.1420 0.1427 0.1231 0.1508 0.1426 0.1410 0.1508 0.1433 0.1501 0.1448 0.1549 0.1574 0.1574
va: 1.2301 1.1043 1.1021 1.1158 2.1498 2.0912 2.0925 3.2165 3.1057 3.8226 3.8285 3.9542 3.9324 4.1683 3.8382 3.9091 3.8924 3.8721 3.5706 3.6127 4.0920 3.9375 3.9129 3.9611 4.4017 3.7659 4.0575 3.8183 3.9817 3.7024 3.8642 3.9940 3.9364 3.8949 3.8892 1.0238 1.0061 1.0033 1.0159 1.0028 1.0040 1.0041 1.0119 1.0396 0.9951 1.0128 1.0272 1.0069 1.0195 1.0035 1.0026 1.0108 0.9903 1.0082 0.9931 0.9894 0.9902
dispcorr: -0.039009167 hartree
energy: -2099.168691557481
dipole: 31.31397 -30.25906 1.05491 -17.85939 19.42378 1.56439 24.59750 -24.28457 0.31294
magnitude: 1.91261 au
magnitude: 4.86148 debye
