program: Orca
programVersion: 5.0.2
elementType: Cl F F F O O O N N C C C C C C C C C C C C C C C C C C C C C C C C C C H H H H H H H H H H H H H H H H H H H H H H
charge: 0
multiplicity: 1
keywords: wb97x-d3
keywords: def2-TZVPP
keywords: def2/J RIJCOSX
keywords: DEFGRID2
keywords: scfconv7
keywords: smallprint printgap noloewdin
keywords: NOSOSCF
formula: C26H22ClF3N2O3
InChI: InChI=1/C26H22ClF3N2O3/c1-16(2)24(32-22-12-11-18(14-21(22)27)26(28,29)30)25(33)35-23(15-31)17-7-6-10-20(13-17)34-19-8-4-3-5-9-19/h3-14,16,23-24,32H,1-2H3
57 atoms
Cl 1.445823 3.382651 -2.556918
F  -3.939939 3.390333 -1.190297
F  -3.581555 1.744319 -2.519034
F  -4.134839 1.37369 -0.470617
O  2.788219 -0.442537 -0.50958
O  2.020707 -0.972705 1.520695
O  -2.223665 -3.015586 0.197683
N  2.127397 2.163034 0.069568
N  3.354526 -3.743401 0.224821
C  4.213841 1.59758 1.21631
C  2.7082 1.30823 1.075006
C  4.428581 3.023129 1.710837
C  4.883278 0.599486 2.154235
C  2.456797 -0.158458 0.753816
C  0.795919 2.148406 -0.229177
C  2.369901 -1.690534 -1.056965
C  0.314177 2.707114 -1.427764
C  -0.165456 1.606353 0.634819
C  0.871674 -1.710309 -1.242816
C  -1.954165 2.160831 -0.877145
C  -1.024492 2.717022 -1.749386
C  -1.510574 1.611725 0.316687
C  0.026714 -2.427505 -0.410501
C  0.349325 -0.909472 -2.255069
C  -3.395791 2.163917 -1.256454
C  -1.348244 -2.316219 -0.581634
C  2.90032 -2.826056 -0.296144
C  -1.021539 -0.826108 -2.425798
C  -1.878787 -1.518357 -1.582723
C  -2.029605 -3.087027 1.550682
C  -2.412344 -4.26535 2.176061
C  -1.526182 -2.02283 2.289593
C  -2.291496 -4.377369 3.553388
C  -1.401666 -2.154384 3.665247
C  -1.781215 -3.327088 4.30376
H  4.67064 1.497782 0.224829
H  2.240587 1.495965 2.045861
H  5.49508 3.239236 1.784899
H  3.992564 3.164294 2.702229
H  3.991551 3.766686 1.044391
H  4.404733 0.588374 3.135631
H  5.928334 0.873247 2.301784
H  4.878698 -0.419981 1.76484
H  2.750354 2.408636 -0.685983
H  2.857681 -1.728533 -2.033742
H  0.131518 1.178298 1.581765
H  -1.332441 3.152135 -2.691811
H  -2.20309 1.172654 1.021784
H  0.424616 -3.064357 0.369996
H  1.011428 -0.352638 -2.906826
H  -1.429716 -0.207462 -3.213393
H  -2.952178 -1.446215 -1.704125
H  -2.805859 -5.08477 1.587519
H  -1.235548 -1.097691 1.8073
H  -2.592859 -5.296707 4.038762
H  -1.007223 -1.326392 4.240006
H  -1.681509 -3.420847 5.377012
elementType: Cl F O N C H
totalener: -2099.13078474 hartree
nucrepener: 4102.80559946 hartree
electener: -6201.93638420 hartree
twoeener: 4837.81237770 hartree
cpcmener: -0.03808002 hartree
kineticenergy: 2091.79552221 hartree
xcener: -173.915002771035 hartree
chargesum: -0.0000000
charge: -0.096817 -0.185966 -0.189566 -0.185499 -0.263766 -0.398465 -0.329966 -0.217989 -0.078508 0.057128 0.115570 -0.292917 -0.298687 0.316928 0.164432 0.419980 0.008249 -0.183357 0.038756 -0.057960 -0.150504 -0.193672 -0.178598 -0.287271 0.574463 0.274527 -0.243749 -0.070543 -0.255137 0.268693 -0.227949 -0.138209 -0.135562 -0.184815 -0.165842 0.059986 0.122641 0.097067 0.087903 0.093203 0.097455 0.094298 0.094130 0.150148 0.145809 0.142839 0.122323 0.147020 0.141246 0.137282 0.153488 0.141908 0.145142 0.129059 0.157533 0.155082 0.157024
qa: -0.0968 -0.1860 -0.1896 -0.1855 -0.2638 -0.3985 -0.3300 -0.2180 -0.0785 0.0571 0.1156 -0.2929 -0.2987 0.3169 0.1644 0.4200 0.0082 -0.1834 0.0388 -0.0580 -0.1505 -0.1937 -0.1786 -0.2873 0.5745 0.2745 -0.2437 -0.0705 -0.2551 0.2687 -0.2279 -0.1382 -0.1356 -0.1848 -0.1658 0.0600 0.1226 0.0971 0.0879 0.0932 0.0975 0.0943 0.0941 0.1501 0.1458 0.1428 0.1223 0.1470 0.1412 0.1373 0.1535 0.1419 0.1451 0.1291 0.1575 0.1551 0.1570
va: 1.2306 1.1059 1.1018 1.1146 2.1508 2.0939 2.0857 3.1991 3.1032 3.8137 3.8470 3.9373 3.9566 4.1182 3.8644 3.9038 3.8439 3.8454 3.5429 3.5936 4.0719 3.9610 3.9254 3.9873 4.3946 3.7600 4.0551 3.8007 3.9803 3.6949 3.9821 3.8432 3.9008 3.9459 3.8888 1.0255 1.0061 1.0048 1.0014 1.0173 1.0048 1.0033 1.0080 1.0481 0.9941 1.0138 1.0289 1.0101 1.0176 1.0094 0.9966 1.0146 1.0084 0.9975 0.9891 0.9927 0.9903
dispcorr: -0.039581687 hartree
energy: -2099.170366428033
dipole: 32.73297 -31.24759 1.48538 -11.68854 13.41609 1.72755 27.91517 -28.31037 -0.39520
magnitude: 2.31235 au
magnitude: 5.87752 debye
