program: Orca
programVersion: 5.0.2
elementType: Cl F F F O O O N N C C C C C C C C C C C C C C C C C C C C C C C C C C H H H H H H H H H H H H H H H H H H H H H H
charge: 0
multiplicity: 1
keywords: wb97x-d3
keywords: def2-TZVPP
keywords: def2/J RIJCOSX
keywords: DEFGRID2
keywords: scfconv7
keywords: smallprint printgap noloewdin
keywords: NOSOSCF
formula: C26H22ClF3N2O3
InChI: InChI=1/C26H22ClF3N2O3/c1-16(2)24(32-22-12-11-18(14-21(22)27)26(28,29)30)25(33)35-23(15-31)17-7-6-10-20(13-17)34-19-8-4-3-5-9-19/h3-14,16,23-24,32H,1-2H3
57 atoms
Cl -1.798356 1.23843 -1.051449
F  -3.181406 1.506055 4.025364
F  -1.541413 2.371456 5.117965
F  -2.834521 3.625044 3.947182
O  1.985598 -0.422222 0.136788
O  3.935851 0.425398 0.842435
O  -1.343142 -3.469357 -2.060281
N  1.072597 1.924333 -0.641784
N  0.821981 -1.210324 3.141578
C  3.15273 1.754016 -1.962526
C  2.500293 1.772245 -0.564229
C  2.770005 0.545231 -2.811148
C  2.859126 3.05698 -2.697052
C  2.911111 0.536283 0.228669
C  0.300783 2.016971 0.481167
C  2.113292 -1.608263 0.90023
C  -1.081079 1.755295 0.442037
C  0.829634 2.388706 1.724718
C  1.496247 -2.751006 0.130582
C  -1.330392 2.248326 2.776457
C  -1.882586 1.871453 1.556914
C  0.031664 2.502705 2.84674
C  0.339601 -2.54231 -0.610476
C  2.08631 -4.005392 0.187118
C  -2.214194 2.431822 3.963246
C  -0.203307 -3.600368 -1.325121
C  1.398017 -1.385249 2.16334
C  1.510131 -5.060566 -0.505988
C  0.373868 -4.862833 -1.272715
C  -1.586229 -2.320209 -2.76637
C  -0.593547 -1.678717 -3.498075
C  -2.890597 -1.849585 -2.77715
C  -0.920599 -0.551111 -4.237102
C  -3.204714 -0.726307 -3.52924
C  -2.222536 -0.068599 -4.255979
H  4.229742 1.708465 -1.778492
H  2.93378 2.625495 -0.03554
H  1.696678 0.488213 -3.005353
H  3.080895 -0.400493 -2.366502
H  3.259567 0.613757 -3.78322
H  1.806618 3.146991 -2.968476
H  3.438421 3.106157 -3.619412
H  3.124881 3.927083 -2.095089
H  0.630942 1.492825 -1.440088
H  3.157705 -1.834196 1.133753
H  1.883518 2.605898 1.829851
H  -2.939444 1.656666 1.464283
H  0.498337 2.796759 3.776857
H  -0.134619 -1.568925 -0.635956
H  2.989002 -4.15892 0.764774
H  1.963033 -6.042201 -0.466088
H  -0.065763 -5.68004 -1.830377
H  0.423383 -2.051257 -3.502626
H  -3.653652 -2.360906 -2.203577
H  -0.148817 -0.052838 -4.809662
H  -4.223725 -0.361377 -3.538068
H  -2.469634 0.81042 -4.836607
elementType: Cl F O N C H
totalener: -2099.13073797 hartree
nucrepener: 4063.55787041 hartree
electener: -6162.68860839 hartree
twoeener: 4798.83624979 hartree
cpcmener: -0.03788541 hartree
kineticenergy: 2091.79353877 hartree
xcener: -173.912925663622 hartree
chargesum: 0.0000000
charge: -0.109130 -0.185728 -0.183037 -0.186531 -0.243364 -0.406168 -0.326388 -0.233566 -0.085171 0.058394 0.108236 -0.276008 -0.296519 0.306934 0.156355 0.363217 0.016655 -0.199814 0.044134 -0.066487 -0.119474 -0.169395 -0.167470 -0.213143 0.551840 0.258871 -0.219950 -0.104414 -0.240795 0.286947 -0.188899 -0.233662 -0.146775 -0.139373 -0.178072 0.062405 0.132303 0.049629 0.093579 0.105199 0.084924 0.099547 0.096676 0.150793 0.133716 0.141261 0.127759 0.146825 0.112792 0.146177 0.159017 0.148413 0.159327 0.145296 0.160595 0.155530 0.155986
qa: -0.1091 -0.1857 -0.1830 -0.1865 -0.2434 -0.4062 -0.3264 -0.2336 -0.0852 0.0584 0.1082 -0.2760 -0.2965 0.3069 0.1564 0.3632 0.0167 -0.1998 0.0441 -0.0665 -0.1195 -0.1694 -0.1675 -0.2131 0.5518 0.2589 -0.2199 -0.1044 -0.2408 0.2869 -0.1889 -0.2337 -0.1468 -0.1394 -0.1781 0.0624 0.1323 0.0496 0.0936 0.1052 0.0849 0.0995 0.0967 0.1508 0.1337 0.1413 0.1278 0.1468 0.1128 0.1462 0.1590 0.1484 0.1593 0.1453 0.1606 0.1555 0.1560
va: 1.2436 1.1124 1.1177 1.0985 2.1443 2.1129 2.0840 3.1973 3.0955 3.8319 3.8330 3.9574 3.9447 4.2330 3.8335 3.7474 3.8702 3.9042 3.6821 3.6611 4.0876 4.0148 3.9385 3.9707 4.4301 3.7528 4.0325 3.8908 4.0080 3.6798 3.8910 3.9869 3.8423 3.8502 3.8579 1.0237 1.0022 1.0068 1.0142 1.0069 1.0091 1.0041 1.0044 1.0463 1.0352 1.0139 1.0249 1.0099 1.0343 1.0009 0.9889 1.0054 0.9937 1.0068 0.9881 0.9904 0.9916
dispcorr: -0.037962943 hartree
energy: -2099.168700916572
dipole: 29.88759 -27.94687 1.94072 -8.87408 8.44069 -0.43339 -42.88986 39.53295 -3.35690
magnitude: 3.90167 au
magnitude: 9.91726 debye
