program: Orca
programVersion: 5.0.2
elementType: Cl F F F O O O N N C C C C C C C C C C C C C C C C C C C C C C C C C C H H H H H H H H H H H H H H H H H H H H H H
charge: 0
multiplicity: 1
keywords: wb97x-d3
keywords: def2-TZVPP
keywords: def2/J RIJCOSX
keywords: DEFGRID2
keywords: scfconv7
keywords: smallprint printgap noloewdin
keywords: NOSOSCF
formula: C26H22ClF3N2O3
InChI: InChI=1/C26H22ClF3N2O3/c1-16(2)24(32-22-12-11-18(14-21(22)27)26(28,29)30)25(33)35-23(15-31)17-7-6-10-20(13-17)34-19-8-4-3-5-9-19/h3-14,16,23-24,32H,1-2H3
57 atoms
Cl -0.631212 1.874706 -2.18475
F  -2.641349 -0.549734 2.808407
F  -2.967215 1.453148 3.50863
F  -3.922825 0.776627 1.70024
O  2.642754 -0.174374 0.107226
O  4.45803 0.539676 1.194514
O  -2.020177 -2.302124 0.143067
N  1.81244 2.244829 -0.555918
N  2.442396 -1.272855 3.317691
C  4.148833 2.568281 -1.159505
C  3.154134 2.144148 -0.05469
C  5.511924 2.951226 -0.597144
C  4.289791 1.51629 -2.258276
C  3.513599 0.764088 0.493917
C  0.703037 1.916194 0.170347
C  2.731174 -1.453526 0.722613
C  -0.531716 1.701783 -0.460314
C  0.727709 1.782016 1.564433
C  1.611036 -2.288511 0.159429
C  -1.604975 1.183554 1.617331
C  -1.66505 1.339482 0.239775
C  -0.400462 1.417164 2.270253
C  0.294364 -1.908716 0.396597
C  1.887995 -3.406761 -0.609324
C  -2.788225 0.718706 2.402845
C  -0.735487 -2.657944 -0.138985
C  2.591336 -1.331273 2.180425
C  0.844079 -4.153099 -1.141339
C  -0.468635 -3.783078 -0.911627
C  -2.795403 -1.761083 -0.838339
C  -2.288941 -1.291118 -2.042739
C  -4.153164 -1.658503 -0.557565
C  -3.156118 -0.726279 -2.968596
C  -5.002233 -1.092214 -1.491543
C  -4.511483 -0.625775 -2.704638
H  3.707866 3.470153 -1.597067
H  3.287443 2.836733 0.784285
H  6.02593 2.1025 -0.149113
H  5.427281 3.728003 0.163254
H  6.146501 3.339549 -1.394142
H  4.821638 0.633273 -1.899069
H  4.866734 1.918682 -3.090642
H  3.333227 1.181935 -2.663687
H  1.710347 2.16309 -1.554138
H  3.701011 -1.91663 0.514945
H  1.642838 1.954558 2.115241
H  -2.583946 1.171356 -0.30499
H  -0.323016 1.306862 3.343616
H  0.059309 -1.043827 1.005113
H  2.913173 -3.702653 -0.793117
H  1.057641 -5.03086 -1.735699
H  -1.286557 -4.363168 -1.318782
H  -1.230898 -1.340488 -2.260971
H  -4.528519 -2.015621 0.392065
H  -2.755941 -0.354311 -3.902457
H  -6.057767 -1.013973 -1.267791
H  -5.179175 -0.185022 -3.43202
totalener: -2099.09957540 hartree
nucrepener: 4177.81276430 hartree
electener: -6276.91233970 hartree
twoeener: 4913.23783374 hartree
kineticenergy: 2091.87401433 hartree
xcener: -173.926027741188 hartree
chargesum: -0.0000000
charge: -0.097950 -0.169238 -0.175489 -0.176803 -0.240437 -0.316263 -0.283778 -0.219475 0.010470 -0.017038 0.083918 -0.267188 -0.268761 0.260269 0.228048 0.314495 0.022101 -0.253327 0.024451 -0.111594 -0.131704 -0.097877 -0.124791 -0.107410 0.558019 0.100900 -0.272652 -0.125936 -0.102326 0.272072 -0.203670 -0.224193 -0.126767 -0.070768 -0.148718 0.064184 0.114788 0.099749 0.081819 0.088150 0.085043 0.098992 0.085809 0.131466 0.113599 0.120942 0.135083 0.126211 0.108646 0.112906 0.130722 0.136366 0.123589 0.127160 0.123869 0.125628 0.124692
qa: -0.0980 -0.1692 -0.1755 -0.1768 -0.2404 -0.3163 -0.2838 -0.2195 0.0105 -0.0170 0.0839 -0.2672 -0.2688 0.2603 0.2280 0.3145 0.0221 -0.2533 0.0245 -0.1116 -0.1317 -0.0979 -0.1248 -0.1074 0.5580 0.1009 -0.2727 -0.1259 -0.1023 0.2721 -0.2037 -0.2242 -0.1268 -0.0708 -0.1487 0.0642 0.1148 0.0997 0.0818 0.0881 0.0850 0.0990 0.0858 0.1315 0.1136 0.1209 0.1351 0.1262 0.1086 0.1129 0.1307 0.1364 0.1236 0.1272 0.1239 0.1256 0.1247
va: 1.2344 1.1213 1.1281 1.1271 2.1394 2.1812 2.0902 3.1869 3.1044 3.9231 3.8488 3.9611 3.9265 4.1615 3.8099 3.8510 3.9150 3.9331 3.6965 3.6964 3.9606 4.0373 3.9853 3.9363 4.4289 4.0263 3.9758 3.9800 3.9885 3.6769 3.8491 3.9893 3.9487 3.9282 3.9703 1.0177 1.0045 1.0120 1.0088 1.0029 1.0100 1.0061 1.0184 1.0717 1.0165 1.0193 1.0040 1.0197 1.0346 1.0101 1.0009 1.0027 1.0195 1.0197 1.0033 0.9985 1.0005
dispcorr: -0.040935980 hartree
energy: -2099.140511384736
dipole: 33.48650 -32.49393 0.99257 0.83432 -0.75866 0.07566 -23.93507 21.45710 -2.47798
magnitude: 2.67045 au
magnitude: 6.78774 debye
