program: Orca
programVersion: 5.0.2
elementType: Cl F F F O O O N N C C C C C C C C C C C C C C C C C C C C C C C C C C H H H H H H H H H H H H H H H H H H H H H H
charge: 0
multiplicity: 1
keywords: wb97x-d3
keywords: def2-TZVPP
keywords: def2/J RIJCOSX
keywords: DEFGRID2
keywords: scfconv7
keywords: smallprint printgap noloewdin
keywords: NOSOSCF
formula: C26H22ClF3N2O3
InChI: InChI=1/C26H22ClF3N2O3/c1-16(2)24(32-22-12-11-18(14-21(22)27)26(28,29)30)25(33)35-23(15-31)17-7-6-10-20(13-17)34-19-8-4-3-5-9-19/h3-14,16,23-24,32H,1-2H3
57 atoms
Cl -0.723662 3.646837 -1.530382
F  -4.068443 0.465613 1.160731
F  -3.076715 -0.031215 3.006799
F  -3.841638 1.956643 2.688256
O  3.204109 -0.682946 0.255352
O  2.015426 -0.119918 -1.560579
O  -1.984069 -2.690351 -0.142594
N  1.703236 2.415803 -0.329749
N  4.860975 -3.398206 1.121542
C  4.080166 2.265003 -0.921154
C  2.89734 1.634892 -0.158737
C  5.386058 1.545088 -0.598284
C  3.87922 2.352374 -2.431759
C  2.645776 0.191963 -0.592289
C  0.527925 2.059451 0.27622
C  2.875233 -2.064892 0.073945
C  -0.703319 2.572279 -0.167642
C  0.482543 1.186494 1.368055
C  1.554315 -2.365174 0.738666
C  -1.915324 1.334374 1.491306
C  -1.898568 2.219016 0.418732
C  -0.714023 0.832786 1.962617
C  0.412295 -2.433347 -0.046404
C  1.469521 -2.484527 2.12098
C  -3.224071 0.929873 2.088181
C  -0.829063 -2.59376 0.558601
C  3.986951 -2.80908 0.665798
C  0.230082 -2.675485 2.709474
C  -0.920492 -2.716948 1.938611
C  -2.202893 -1.960595 -1.278573
C  -1.664527 -0.697808 -1.484087
C  -3.056158 -2.524765 -2.216776
C  -1.980861 -0.007082 -2.643937
C  -3.372371 -1.817277 -3.365252
C  -2.834076 -0.558074 -3.587598
H  4.150886 3.283707 -0.526289
H  3.176595 1.634799 0.898953
H  5.547934 1.451733 0.475833
H  6.229617 2.097939 -1.010899
H  5.4208 0.542566 -1.027146
H  2.973423 2.885836 -2.7242
H  3.843321 1.368419 -2.898725
H  4.712977 2.895664 -2.876956
H  1.599693 2.856784 -1.228929
H  2.829125 -2.312149 -0.990783
H  1.390864 0.760534 1.769675
H  -2.817819 2.622089 0.014986
H  -0.687097 0.142746 2.792788
H  0.488645 -2.343236 -1.122058
H  2.361085 -2.445461 2.734059
H  0.155234 -2.78391 3.783278
H  -1.89137 -2.850999 2.396639
H  -1.003615 -0.247633 -0.756574
H  -3.473311 -3.506827 -2.036872
H  -1.556214 0.975798 -2.800491
H  -4.042396 -2.257912 -4.091542
H  -3.079626 -0.010424 -4.487231
totalener: -2099.10320739 hartree
nucrepener: 4163.24237187 hartree
electener: -6262.34557926 hartree
twoeener: 4898.01866091 hartree
kineticenergy: 2091.86572205 hartree
xcener: -173.925681992457 hartree
chargesum: 0.0000000
charge: -0.090887 -0.170560 -0.180587 -0.173136 -0.243735 -0.340898 -0.296874 -0.236375 0.003437 -0.010689 0.155124 -0.277129 -0.263498 0.236036 0.230899 0.298421 -0.030298 -0.142675 0.028723 -0.044443 -0.158964 -0.198831 -0.193615 -0.196715 0.551644 0.311507 -0.258048 -0.107509 -0.231897 0.273621 -0.098358 -0.213662 -0.135682 -0.091791 -0.148259 0.067444 0.110709 0.096796 0.093662 0.080956 0.077140 0.093152 0.095104 0.141026 0.126770 0.112182 0.108582 0.144239 0.137551 0.122949 0.136209 0.132709 0.068143 0.124115 0.128782 0.124096 0.123392
qa: -0.0909 -0.1706 -0.1806 -0.1731 -0.2437 -0.3409 -0.2969 -0.2364 0.0034 -0.0107 0.1551 -0.2771 -0.2635 0.2360 0.2309 0.2984 -0.0303 -0.1427 0.0287 -0.0444 -0.1590 -0.1988 -0.1936 -0.1967 0.5516 0.3115 -0.2580 -0.1075 -0.2319 0.2736 -0.0984 -0.2137 -0.1357 -0.0918 -0.1483 0.0674 0.1107 0.0968 0.0937 0.0810 0.0771 0.0932 0.0951 0.1410 0.1268 0.1122 0.1086 0.1442 0.1376 0.1229 0.1362 0.1327 0.0681 0.1241 0.1288 0.1241 0.1234
va: 1.2319 1.1274 1.1204 1.1266 2.1314 2.1426 2.1266 3.2295 3.1152 3.9156 3.8361 3.9481 3.9590 4.1654 3.8322 3.8573 3.8821 3.8824 3.5996 3.6570 4.0944 4.0238 3.9451 3.9741 4.4225 3.7712 4.0173 3.8755 3.9760 3.7959 3.8560 4.0259 3.9671 3.9446 3.9876 1.0126 1.0111 1.0088 1.0043 1.0116 1.0154 1.0106 1.0031 1.0676 1.0179 1.0261 1.0334 1.0132 1.0153 1.0165 0.9969 1.0178 1.0146 1.0148 1.0090 0.9988 1.0012
dispcorr: -0.041200409 hartree
energy: -2099.144407798889
dipole: 36.02619 -35.36279 0.66340 -2.92389 3.86513 0.94124 -17.61101 17.04146 -0.56955
magnitude: 1.28469 au
magnitude: 3.26541 debye
