program: Orca
programVersion: 5.0.2
elementType: Cl F F F O O O N N C C C C C C C C C C C C C C C C C C C C C C C C C C H H H H H H H H H H H H H H H H H H H H H H
charge: 0
multiplicity: 1
keywords: wb97x-d3
keywords: def2-TZVPP
keywords: def2/J RIJCOSX
keywords: DEFGRID2
keywords: scfconv7
keywords: smallprint printgap noloewdin
keywords: NOSOSCF
formula: C26H22ClF3N2O3
InChI: InChI=1/C26H22ClF3N2O3/c1-16(2)24(32-22-12-11-18(14-21(22)27)26(28,29)30)25(33)35-23(15-31)17-7-6-10-20(13-17)34-19-8-4-3-5-9-19/h3-14,16,23-24,32H,1-2H3
57 atoms
Cl -0.718463 3.617341 -1.583627
F  -3.01081 0.333931 3.283737
F  -3.916906 2.109963 2.463466
F  -3.922733 0.282748 1.337974
O  3.210669 -0.723207 0.264616
O  1.985609 -0.239217 -1.549806
O  -1.992766 -2.675657 0.022708
N  1.71215 2.355513 -0.42721
N  4.865568 -3.401793 1.24352
C  4.073892 2.158478 -1.067424
C  2.904481 1.573968 -0.248809
C  5.381131 1.43944 -0.747222
C  3.83587 2.18227 -2.575258
C  2.636825 0.114272 -0.610194
C  0.548784 2.044475 0.224486
C  2.874646 -2.111046 0.152992
C  -0.683123 2.574818 -0.196571
C  0.5150 1.206248 1.343881
C  1.56038 -2.372304 0.846617
C  -1.875138 1.414921 1.533037
C  -1.868231 2.267377 0.434336
C  -0.671713 0.898683 1.983339
C  0.407083 -2.458247 0.080244
C  1.492598 -2.433175 2.233908
C  -3.179388 1.034956 2.157768
C  -0.828434 -2.571763 0.707222
C  3.990944 -2.829584 0.767877
C  0.258704 -2.581353 2.84588
C  -0.903065 -2.636015 2.092206
C  -2.217714 -1.968011 -1.126368
C  -3.096301 -2.537733 -2.037432
C  -1.658333 -0.721565 -1.371227
C  -3.416254 -1.852115 -3.198158
C  -1.977776 -0.05377 -2.543383
C  -2.85596 -0.610304 -3.460342
H  4.16446 3.192539 -0.719267
H  3.208085 1.620234 0.801311
H  5.398344 0.421037 -1.138233
H  5.567681 1.38582 0.325654
H  6.21903 1.968811 -1.200215
H  3.757991 1.180126 -2.995443
H  4.673452 2.678314 -3.065818
H  2.939736 2.730799 -2.868885
H  1.593167 2.764935 -1.339187
H  2.815972 -2.408386 -0.89823
H  1.424934 0.772229 1.733377
H  -2.788285 2.686625 0.049378
H  -0.635588 0.235059 2.83457
H  0.469234 -2.415261 -0.99914
H  2.392941 -2.381011 2.833183
H  0.197212 -2.643511 3.924229
H  -1.869811 -2.733244 2.568415
H  -3.530291 -3.506348 -1.826804
H  -0.978503 -0.266814 -0.66444
H  -4.106028 -2.296914 -3.903123
H  -1.536287 0.916104 -2.731136
H  -3.103565 -0.080399 -4.369949
totalener: -2099.10312056 hartree
nucrepener: 4166.09443382 hartree
electener: -6265.19755437 hartree
twoeener: 4900.86957885 hartree
kineticenergy: 2091.86042560 hartree
xcener: -173.925083141856 hartree
chargesum: -0.0000000
charge: -0.089976 -0.180450 -0.175024 -0.166870 -0.244006 -0.340925 -0.296211 -0.234553 0.003604 -0.009118 0.156400 -0.277349 -0.265797 0.235129 0.240219 0.297959 -0.050721 -0.145674 0.031985 -0.054783 -0.148109 -0.191705 -0.197490 -0.197785 0.553238 0.308088 -0.257447 -0.106724 -0.232696 0.270137 -0.210931 -0.095489 -0.092804 -0.136397 -0.147831 0.067830 0.111329 0.080939 0.097389 0.093223 0.094786 0.094267 0.077257 0.140454 0.127214 0.111439 0.109363 0.143564 0.138571 0.123043 0.136942 0.134205 0.123910 0.068774 0.123806 0.128488 0.123312
qa: -0.0900 -0.1805 -0.1750 -0.1669 -0.2440 -0.3409 -0.2962 -0.2346 0.0036 -0.0091 0.1564 -0.2773 -0.2658 0.2351 0.2402 0.2980 -0.0507 -0.1457 0.0320 -0.0548 -0.1481 -0.1917 -0.1975 -0.1978 0.5532 0.3081 -0.2574 -0.1067 -0.2327 0.2701 -0.2109 -0.0955 -0.0928 -0.1364 -0.1478 0.0678 0.1113 0.0809 0.0974 0.0932 0.0948 0.0943 0.0773 0.1405 0.1272 0.1114 0.1094 0.1436 0.1386 0.1230 0.1369 0.1342 0.1239 0.0688 0.1238 0.1285 0.1233
va: 1.2334 1.1226 1.1275 1.1257 2.1308 2.1410 2.1282 3.2301 3.1151 3.9134 3.8312 3.9478 3.9593 4.1626 3.8182 3.8560 3.8946 3.8828 3.5925 3.6804 4.0825 4.0116 3.9479 3.9734 4.4247 3.7747 4.0180 3.8743 3.9797 3.7939 4.0232 3.8544 3.9463 3.9665 3.9868 1.0123 1.0114 1.0114 1.0087 1.0045 1.0107 1.0032 1.0148 1.0674 1.0174 1.0270 1.0327 1.0146 1.0152 1.0168 0.9967 1.0157 1.0149 1.0095 0.9988 1.0096 1.0012
dispcorr: -0.041341780 hartree
energy: -2099.144462335043
dipole: 35.70769 -35.02848 0.67921 -4.02184 4.93486 0.91303 -18.39851 17.77027 -0.62824
magnitude: 1.29986 au
magnitude: 3.30397 debye
