program: Orca
programVersion: 5.0.2
elementType: Cl Cl F O O O N C C C C C C C C C C C C C C C C C C C C C C C C C C C C H H H H H H H H H H H H H H H H H H H H H H
charge: 0
multiplicity: 1
keywords: wb97x-d3
keywords: def2-TZVPP
keywords: def2/J RIJCOSX
keywords: DEFGRID2
keywords: scfconv7
keywords: smallprint printgap noloewdin
keywords: NOSOSCF
formula: C28H22Cl2FNO3
InChI: InChI=1/C28H22Cl2FNO3/c1-28(2)21(15-22(30)17-8-11-19(29)12-9-17)26(28)27(33)35-25(16-32)18-10-13-23(31)24(14-18)34-20-6-4-3-5-7-20/h3-15,21,25-26H,1-2H3
57 atoms
Cl 0.847565 0.516862 2.162793
Cl 7.397044 -0.807104 0.292983
F  -3.294145 -4.286648 -0.372951
O  -3.058873 1.916744 0.132207
O  -3.213225 1.384054 -2.030441
O  -1.245206 -2.712577 0.382327
N  -4.860672 1.764556 2.884435
C  -0.65859 3.651188 -0.705638
C  -0.249774 2.364495 -0.050761
C  -1.193644 2.341704 -1.248115
C  0.306303 4.374263 -1.614542
C  -1.537434 4.595509 0.078761
C  1.096881 1.800631 -0.169049
C  -2.574994 1.849096 -1.118263
C  1.712983 1.033563 0.735124
C  -4.233028 1.174845 0.41772
C  3.108045 0.574954 0.648523
C  -4.002471 -0.314221 0.278582
C  3.559859 -0.552357 1.334953
C  4.025934 1.271412 -0.14262
C  -4.568531 1.517325 1.800095
C  4.871651 -0.983386 1.227171
C  5.337573 0.84791 -0.264815
C  -2.73808 -0.83843 0.503945
C  -5.04095 -1.143039 -0.119232
C  5.753522 -0.280835 0.424065
C  -2.494974 -2.176862 0.25467
C  -4.817337 -2.498099 -0.30668
C  -3.541444 -2.995916 -0.140532
C  -0.258601 -2.284752 -0.477744
C  -0.496589 -1.483017 -1.587457
C  1.026773 -2.724931 -0.186705
C  0.572317 -1.114031 -2.395766
C  2.077232 -2.359756 -1.013252
C  1.859924 -1.546172 -2.117849
H  -0.735495 2.18442 0.89994
H  -0.757592 2.040543 -2.193824
H  -0.237618 5.063849 -2.261744
H  0.873513 3.704034 -2.258679
H  1.015547 4.960442 -1.028037
H  -2.130143 4.104264 0.846426
H  -2.216441 5.133799 -0.584583
H  -0.911171 5.336164 0.578738
H  1.656607 2.035806 -1.066675
H  -5.072973 1.486612 -0.211958
H  2.888639 -1.124755 1.959334
H  3.732297 2.174707 -0.660018
H  -1.914691 -0.215738 0.833649
H  5.19401 -1.863542 1.766407
H  6.029037 1.408426 -0.878869
H  -6.027239 -0.734716 -0.296945
H  -5.61842 -3.155134 -0.617253
H  -1.490003 -1.138631 -1.841248
H  1.199818 -3.352133 0.678446
H  0.383498 -0.482597 -3.254201
H  3.075237 -2.708973 -0.784685
H  2.685558 -1.252984 -2.752007
elementType: Cl F O N C H
totalener: -2380.99344558 hartree
nucrepener: 4081.01018451 hartree
electener: -6462.00363008 hartree
twoeener: 4919.13094956 hartree
cpcmener: -0.04486373 hartree
kineticenergy: 2373.48266257 hartree
xcener: -182.590818504024 hartree
chargesum: -0.0000000
charge: -0.119481 -0.094848 -0.208962 -0.281180 -0.452018 -0.337502 -0.097670 0.071510 0.090643 -0.064607 -0.286222 -0.267320 -0.190146 0.373142 0.033025 0.378174 0.103680 -0.029940 -0.201044 -0.207530 -0.220360 -0.174141 -0.146189 -0.137231 -0.167328 0.120960 0.171926 -0.171496 0.239300 0.346459 -0.196333 -0.278805 -0.172964 -0.082520 -0.209407 0.091262 0.107420 0.101879 0.094087 0.103502 0.094523 0.102729 0.097916 0.134453 0.152796 0.139005 0.144436 0.133926 0.144884 0.144941 0.153130 0.155820 0.151546 0.142750 0.160007 0.159378 0.156035
qa: -0.1195 -0.0948 -0.2090 -0.2812 -0.4520 -0.3375 -0.0977 0.0715 0.0906 -0.0646 -0.2862 -0.2673 -0.1901 0.3731 0.0330 0.3782 0.1037 -0.0299 -0.2010 -0.2075 -0.2204 -0.1741 -0.1462 -0.1372 -0.1673 0.1210 0.1719 -0.1715 0.2393 0.3465 -0.1963 -0.2788 -0.1730 -0.0825 -0.2094 0.0913 0.1074 0.1019 0.0941 0.1035 0.0945 0.1027 0.0979 0.1345 0.1528 0.1390 0.1444 0.1339 0.1449 0.1449 0.1531 0.1558 0.1515 0.1427 0.1600 0.1594 0.1560
va: 1.2124 1.2115 1.0856 2.1117 2.0395 2.0829 3.1074 3.8372 3.7215 3.8167 3.9178 3.9052 3.7887 4.1464 3.8105 3.7281 3.4558 3.6659 3.9448 4.0116 4.0756 4.0183 3.9818 3.9335 3.9278 3.8249 3.6979 3.8753 4.0622 3.6059 3.8012 3.9632 3.8609 3.8006 3.8655 1.0365 1.0204 1.0005 1.0052 0.9997 1.0110 1.0001 0.9996 1.0042 1.0102 1.0235 1.0056 1.0136 1.0070 1.0058 0.9980 0.9954 1.0114 1.0124 0.9930 0.9840 0.9931
dispcorr: -0.040104561 hartree
energy: -2381.033550140438
dipole: -6.82392 7.11783 0.29391 26.00729 -24.33893 1.66837 -15.65363 13.77244 -1.88119
magnitude: 2.53154 au
magnitude: 6.43467 debye
