program: Orca
programVersion: 5.0.2
elementType: Cl Cl F O O O N C C C C C C C C C C C C C C C C C C C C C C C C C C C C H H H H H H H H H H H H H H H H H H H H H H
charge: 0
multiplicity: 1
keywords: wb97x-d3
keywords: def2-TZVPP
keywords: def2/J RIJCOSX
keywords: DEFGRID2
keywords: scfconv7
keywords: smallprint printgap noloewdin
keywords: NOSOSCF
formula: C28H22Cl2FNO3
InChI: InChI=1/C28H22Cl2FNO3/c1-28(2)21(15-22(30)17-8-11-19(29)12-9-17)26(28)27(33)35-25(16-32)18-10-13-23(31)24(14-18)34-20-6-4-3-5-7-20/h3-15,21,25-26H,1-2H3
57 atoms
Cl 2.21606 4.279803 -0.300997
Cl 8.579636 3.148321 2.256024
F  -6.441112 -2.026848 -2.29055
O  -1.716968 -0.256135 1.396735
O  -1.952124 1.507212 0.042848
O  -4.524338 -3.613386 -1.420782
N  -3.365266 -1.566416 3.936233
C  0.597766 0.217987 -1.301356
C  0.98307 1.423448 -0.493142
C  0.136303 0.331636 0.138953
C  1.615076 -0.860575 -1.581994
C  -0.374128 0.415717 -2.437879
C  2.344205 1.622325 0.012226
C  -1.262973 0.621704 0.484125
C  2.996705 2.779906 0.129752
C  -3.086847 -0.139981 1.764191
C  4.375635 2.906378 0.627568
C  -4.009388 -0.64651 0.683378
C  5.301779 1.892216 0.37528
C  4.789397 4.009191 1.375349
C  -3.223921 -0.942747 2.980313
C  6.590236 1.957833 0.876792
C  6.076776 4.088035 1.880454
C  -3.804626 -1.917091 0.155724
C  -5.035792 0.156267 0.213964
C  6.968395 3.057366 1.63081
C  -4.622565 -2.379411 -0.860009
C  -5.874387 -0.311727 -0.787709
C  -5.652718 -1.563078 -1.316334
C  -3.29211 -4.213366 -1.553011
C  -3.220156 -5.566297 -1.259615
C  -2.181063 -3.520167 -2.015906
C  -2.018061 -6.236891 -1.43745
C  -0.98302 -4.201515 -2.174856
C  -0.894721 -5.557715 -1.88852
H  0.438859 2.325146 -0.749449
H  0.643217 -0.330606 0.831295
H  2.249214 -1.086333 -0.726129
H  2.259857 -0.56779 -2.411999
H  1.109833 -1.785119 -1.865633
H  0.181109 0.570365 -3.364155
H  -1.028656 1.273463 -2.304934
H  -0.996245 -0.471408 -2.572726
H  2.878243 0.740124 0.346261
H  -3.342587 0.891891 2.026523
H  5.026359 1.042333 -0.234906
H  4.104723 4.819583 1.585706
H  -3.008262 -2.545982 0.536598
H  7.292647 1.162894 0.667136
H  6.374034 4.947419 2.465816
H  -5.18821 1.145798 0.623678
H  -6.682565 0.298958 -1.167768
H  -4.097433 -6.090202 -0.901736
H  -2.239316 -2.46493 -2.253875
H  -1.961497 -7.293781 -1.212524
H  -0.113751 -3.664395 -2.53183
H  0.042802 -6.081254 -2.018735
elementType: Cl F O N C H
totalener: -2380.99890736 hartree
nucrepener: 3711.84945346 hartree
electener: -6092.84836082 hartree
twoeener: 4549.39994252 hartree
cpcmener: -0.04574992 hartree
kineticenergy: 2373.47275942 hartree
xcener: -182.580969780790 hartree
chargesum: -0.0000000
charge: -0.114185 -0.095483 -0.210249 -0.283542 -0.464532 -0.334623 -0.100408 0.087544 0.012662 -0.064190 -0.269601 -0.264821 -0.155117 0.390838 0.034652 0.427274 0.089298 -0.005410 -0.213279 -0.174855 -0.223861 -0.145223 -0.163738 -0.191656 -0.182829 0.101551 0.199737 -0.152622 0.189142 0.288758 -0.241237 -0.222780 -0.123585 -0.155891 -0.189432 0.081101 0.101355 0.093783 0.103086 0.091491 0.102627 0.095505 0.091719 0.136372 0.143937 0.150946 0.139690 0.153570 0.145004 0.145115 0.153058 0.154703 0.149766 0.186870 0.161408 0.179900 0.160687
qa: -0.1142 -0.0955 -0.2102 -0.2835 -0.4645 -0.3346 -0.1004 0.0875 0.0127 -0.0642 -0.2696 -0.2648 -0.1551 0.3908 0.0347 0.4273 0.0893 -0.0054 -0.2133 -0.1749 -0.2239 -0.1452 -0.1637 -0.1917 -0.1828 0.1016 0.1997 -0.1526 0.1891 0.2888 -0.2412 -0.2228 -0.1236 -0.1559 -0.1894 0.0811 0.1014 0.0938 0.1031 0.0915 0.1026 0.0955 0.0917 0.1364 0.1439 0.1509 0.1397 0.1536 0.1450 0.1451 0.1531 0.1547 0.1498 0.1869 0.1614 0.1799 0.1607
va: 1.2192 1.2103 1.0808 2.1303 2.0456 2.0762 3.1108 3.7358 3.8780 3.8403 3.9144 3.8971 3.8514 4.1832 3.8803 3.7158 3.5926 3.6327 4.0055 3.9843 4.0870 3.9826 4.0240 3.9340 3.9244 3.8397 3.7282 3.8780 4.0638 3.7082 3.9971 3.9202 3.8808 3.8859 3.9247 1.0518 1.0316 1.0074 1.0008 1.0101 1.0010 1.0181 1.0024 1.0047 1.0152 1.0018 1.0213 1.0124 1.0056 1.0065 1.0011 0.9963 1.0060 0.9698 0.9877 0.9783 0.9907
dispcorr: -0.030884764 hartree
energy: -2381.029792119651
dipole: -5.12763 6.19811 1.07048 -20.51165 20.05874 -0.45291 -14.65317 13.44095 -1.21222
magnitude: 1.67944 au
magnitude: 4.26881 debye
