program: Orca
programVersion: 5.0.2
elementType: Cl Cl F O O O N C C C C C C C C C C C C C C C C C C C C C C C C C C C C H H H H H H H H H H H H H H H H H H H H H H
charge: 0
multiplicity: 1
keywords: wb97x-d3
keywords: def2-TZVPP
keywords: def2/J RIJCOSX
keywords: DEFGRID2
keywords: scfconv7
keywords: smallprint printgap noloewdin
keywords: NOSOSCF
formula: C28H22Cl2FNO3
InChI: InChI=1/C28H22Cl2FNO3/c1-28(2)21(15-22(30)17-8-11-19(29)12-9-17)26(28)27(33)35-25(16-32)18-10-13-23(31)24(14-18)34-20-6-4-3-5-7-20/h3-15,21,25-26H,1-2H3
57 atoms
Cl 0.431561 1.066987 1.529483
Cl 6.900208 -1.062153 0.270735
F  -4.090994 -4.696129 -0.896867
O  -2.673637 1.313123 -0.41824
O  -2.941318 3.286631 0.588798
O  -1.696817 -3.633019 -0.785949
N  -3.115804 0.830451 2.925788
C  -0.575402 4.294284 -1.238271
C  0.033716 3.561351 -0.097107
C  -1.088295 2.908626 -0.901803
C  0.186267 4.376881 -2.539562
C  -1.402299 5.52324 -0.950904
C  1.363804 2.920596 -0.133156
C  -2.321249 2.58946 -0.176295
C  1.65982 1.805626 0.533796
C  -3.694336 0.733769 0.371599
C  2.947633 1.099532 0.492577
C  -3.807367 -0.721688 -0.010045
C  3.473494 0.461839 1.615573
C  3.668408 1.051468 -0.70088
C  -3.353864 0.821219 1.799989
C  4.691401 -0.194624 1.556635
C  4.887062 0.397822 -0.773383
C  -2.649596 -1.467504 -0.220358
C  -5.055846 -1.310569 -0.10032
C  5.389065 -0.223015 0.359005
C  -2.746118 -2.813313 -0.526421
C  -5.157394 -2.663836 -0.398852
C  -4.0116 -3.393244 -0.605626
C  -0.408229 -3.176689 -0.586675
C  0.409101 -3.032714 -1.695236
C  0.062554 -2.92692 0.694128
C  1.730198 -2.643498 -1.514555
C  1.380072 -2.524343 0.858829
C  2.21711 -2.386174 -0.241113
H  -0.278265 3.904479 0.886244
H  -0.763191 2.127099 -1.57831
H  0.901958 5.200208 -2.509873
H  -0.49733 4.560923 -3.369418
H  0.736677 3.462283 -2.762196
H  -0.772259 6.40975 -1.039952
H  -1.831006 5.527526 0.048364
H  -2.215401 5.624364 -1.671223
H  2.150715 3.377036 -0.723986
H  -4.653029 1.241127 0.226279
H  2.938111 0.473051 2.555446
H  3.268373 1.509545 -1.595791
H  -1.676508 -0.999557 -0.144018
H  5.085606 -0.680792 2.438445
H  5.426001 0.361464 -1.710098
H  -5.951887 -0.726706 0.062338
H  -6.123004 -3.145895 -0.47448
H  0.021854 -3.232374 -2.686144
H  -0.587565 -3.044801 1.55207
H  2.376854 -2.537035 -2.375487
H  1.754266 -2.323607 1.85392
H  3.246341 -2.081785 -0.10458
elementType: Cl F O N C H
totalener: -2380.99515733 hartree
nucrepener: 4007.54782648 hartree
electener: -6388.54298381 hartree
twoeener: 4846.53941416 hartree
cpcmener: -0.04465637 hartree
kineticenergy: 2373.48588456 hartree
xcener: -182.585649659121 hartree
chargesum: 0.0000000
charge: -0.119132 -0.098094 -0.212204 -0.275640 -0.462988 -0.332536 -0.098314 0.152751 -0.067284 -0.108150 -0.280702 -0.282009 -0.153685 0.382175 0.136175 0.429495 0.088662 -0.028676 -0.237820 -0.225024 -0.243280 -0.125255 -0.138983 -0.146867 -0.196276 0.102066 0.208862 -0.149936 0.190318 0.242433 -0.179373 -0.157384 -0.180673 -0.207774 -0.132883 0.119362 0.102035 0.103171 0.099933 0.092091 0.095652 0.092829 0.103374 0.144018 0.138510 0.135238 0.152001 0.117480 0.142767 0.144297 0.150836 0.152675 0.150541 0.158083 0.156945 0.157756 0.198413
qa: -0.1191 -0.0981 -0.2122 -0.2756 -0.4630 -0.3325 -0.0983 0.1528 -0.0673 -0.1082 -0.2807 -0.2820 -0.1537 0.3822 0.1362 0.4295 0.0887 -0.0287 -0.2378 -0.2250 -0.2433 -0.1253 -0.1390 -0.1469 -0.1963 0.1021 0.2089 -0.1499 0.1903 0.2424 -0.1794 -0.1574 -0.1807 -0.2078 -0.1329 0.1194 0.1020 0.1032 0.0999 0.0921 0.0957 0.0928 0.1034 0.1440 0.1385 0.1352 0.1520 0.1175 0.1428 0.1443 0.1508 0.1527 0.1505 0.1581 0.1569 0.1578 0.1984
va: 1.2296 1.2038 1.0768 2.1399 2.0346 2.0744 3.1041 3.7416 3.8994 3.8098 3.9162 3.8792 3.7998 4.1720 3.7311 3.7334 3.4551 3.8093 3.9614 3.9845 4.0279 3.9581 3.9647 3.9159 3.9301 3.8156 3.7582 3.8827 4.0421 3.6950 3.9901 3.9179 3.9457 3.8927 3.7840 1.0230 1.0283 0.9994 1.0026 1.0016 1.0010 1.0180 0.9987 0.9978 1.0145 1.0247 0.9999 1.0414 1.0071 1.0068 1.0010 0.9974 1.0024 0.9960 0.9948 0.9962 0.9506
dispcorr: -0.036559568 hartree
energy: -2381.031716898077
dipole: -3.71214 4.38369 0.67156 27.82034 -26.52703 1.29331 -13.99303 11.41373 -2.57930
magnitude: 2.96250 au
magnitude: 7.53008 debye
