program: Gaussian 09
title: 000069436
version: EM64L-G09RevD.01
frameworkgroup: C1[X(C7H7NO4S)]
method: RPBEPBE
basis: SDD
operation: Freq
keyword: #p
keyword: freq=noraman
keyword: PBEPBE/SDD
title: #p freq=noraman PBEPBE/SDD
converged: YES YES NO NO
title: Mulliken charges:
elementType: S O O O O N C C C C C C C H H H H H H H
charge: 0.952683 -0.539489 -0.516901 -0.461303 -0.220060 -0.725349 -0.150291 0.333340 -0.242318 -0.327073 -0.210655 -0.211999 0.138771 0.308234 0.278401 0.250611 0.246996 0.342454 0.353285 0.400663
chargesum: 0.00000
title: Mulliken charges with hydrogens summed into heavy atoms:
elementType: S O O O O N C C C C C C C
charge: 0.952683 -0.539489 -0.516901 -0.060640 -0.220060 -0.029611 -0.150291 0.333340 0.065916 -0.048673 0.039956 0.034997 0.138771
polarizability: 1.43226755e+02 4.79475002e+00 1.39556034e+02 5.01260935e+00 -3.78218450e+00 7.12991193e+01
1716.lowfreq: -8.4592 0.0022 0.0024 0.0025 6.6342 13.5472 47.4136 89.9443 113.8804
frequency: 47.2940 89.9254 113.8532 146.6310 161.3118 188.6940 217.4742 232.5376 255.5643 285.2137 325.2401 365.8111 389.5893 410.8283 424.1541 465.1925 504.1829 527.0786 565.1750 604.0807 641.8357 684.8635 748.6388 756.7841 781.5296 793.0357 817.0643 909.6817 924.3090 986.6920 990.9102 1011.8301 1012.4983 1050.4893 1086.4010 1120.8279 1176.4132 1178.4683 1261.5658 1317.0580 1379.1760 1424.6816 1458.0826 1507.9749 1566.9544 1604.9352 1654.0775 3142.5853 3150.6699 3162.3345 3176.8381 3381.8851 3530.6329 3559.7879
redmass: 11.3551 5.6812 5.4747 5.7679 5.7778 8.1854 3.7195 3.4141 6.5416 2.5501 8.5816 4.6372 2.7837 3.3990 9.1931 3.3732 3.7578 3.5865 1.6659 4.0861 5.9846 4.3338 3.6284 3.6549 2.1266 1.5037 5.7357 1.4024 6.7014 1.3832 6.6604 1.3799 4.9478 1.9216 1.4020 1.7554 1.0767 1.6376 1.4370 2.4462 6.4262 2.3748 2.5013 1.1006 6.0055 6.9587 9.0496 1.0874 1.0899 1.0943 1.1008 1.0405 1.0641 1.1022
irintensity: 3.7590 0.5611 2.2428 6.9677 4.0837 0.8874 6.5686 18.4466 3.2304 9.7156 15.7840 6.2124 53.2277 11.1461 59.8260 78.6588 42.3052 7.1909 85.6678 38.5925 11.0593 69.0519 21.0108 9.6260 135.1553 60.1002 42.9960 1.0319 82.1132 3.4183 56.9516 0.2067 86.6672 60.1939 41.7678 15.4816 8.9525 109.9690 0.1941 84.7025 2.6844 27.1058 6.6211 31.1235 10.3875 21.3913 278.5883 8.9068 0.5913 2.1055 17.6242 29.9972 61.1452 60.6150
temp: 298.150 k
press: 1.00000 atm
elementType: 16 8 8 8 8 7 6 6 6 6 6 6 6 1 1 1 1 1 1 1
symmnumber: 1
zpe: 354521.4 jmol-1
zpe.correction: 0.135030 hartree
zpe.thermalcorrener: 0.147739 hartree
zpe.thermalcorrenthalpy: 0.148683 hartree
zpe.thermalcorrgfe: 0.096148 hartree
zpe.sumelectzpe: -1023.520399 hartree
zpe.sumelectthermal: -1023.507690 hartree
zpe.sumelectthermalent: -1023.506745 hartree
zpe.sumelectthermalfe: -1023.559281 hartree
dipole: -2.7148 0.1385 3.6426
dipole: 4.5451
quadrupole: -77.6727 -76.7865 -89.5760
quadrupole: 15.8496 7.1607 5.9782
quadrupole: 3.6723 4.5586 -8.2309 15.8496 7.1607 5.9782
hfenergy: -1023.6554287 hartree
pointgroup: C01 [X(C7H7N1O4S1)]
dipole: -1.0910202 -0.430584 -1.3497434 debye
dipolederiv: 1.7928161 0.2226159 -0.1485438 0.1369059 1.3149024 0.0285851 -0.0690882 0.0193605 1.578881 -0.6314137 -0.0929875 0.0259188 -0.0731138 -0.6571619 -0.0701312 0.0114715 0.0311272 -0.4900162 -0.7096681 -0.017075 -0.0659593 0.0272556 -0.5701084 0.1471709 -0.0738155 0.0364339 -0.6400523 -0.9305702 -0.0730848 0.3969652 -0.0402817 -0.4135855 -0.048243 0.4432389 -0.0816038 -0.6060631 -0.4835442 0.0520468 0.1128548 -0.0563783 -1.0624179 0.2080963 0.1570483 0.1178296 -0.4289577 -0.6681752 0.0124803 0.0931521 -0.014369 -0.5065975 -0.0037429 0.1263768 0.0584049 -0.8786799 0.0660575 0.0814542 -0.0207632 -0.2171775 0.0202707 0.0393514 -0.1099977 -0.0897348 -0.1494097 -0.3931276 0.1244419 0.0614799 0.4053245 -0.3413221 -0.0234938 0.0492368 0.0078397 0.0121464 -0.4090202 0.1490891 0.0204381 -0.0759625 -0.1070936 -0.0044353 0.0210858 -0.0180383 -0.0837735 -0.0315889 -0.0730872 -0.0082559 0.0042093 0.0175669 -0.0021124 -0.0357885 0.0452916 -0.0882179 0.1485375 -0.1496077 -0.0252102 0.0247526 0.108341 0.0054033 0.0146337 0.0249124 -0.1127251 0.1612066 0.0573937 -0.0225318 -0.0351053 -0.1373648 0.0026435 -0.0258262 -0.0108627 -0.1267547 1.2214514 -0.2864713 -0.5708838 -0.1626562 1.5207273 -0.2200511 -0.55792 -0.1247406 0.6439299 0.1668739 -0.0387238 -0.0056441 0.0005031 0.0825025 -0.0023347 -0.0177114 -0.0008882 0.1585201 0.0686237 -0.0324241 0.001468 -0.0492351 0.0127421 -0.0047394 0.0236205 -0.0058097 0.1557291 -0.0066234 0.0686833 0.0103143 0.0821515 -0.0064063 -0.0118732 0.0122308 -0.0107942 0.1575981 -0.0862777 -0.0201542 0.0187552 -0.0314238 0.0901728 0.0001231 0.012291 -0.0047542 0.1575342 0.1367355 -0.0853026 0.0277085 0.0006854 0.2307283 -0.1231166 0.0262395 -0.0734522 0.2059 0.2679574 0.078918 0.0846315 0.064425 0.2168164 0.0218682 0.0296165 -0.0415827 0.1853577 0.3197497 0.021795 0.0141055 0.0094902 0.1872873 0.0610315 -0.0369424 0.1210617 0.3490536 unknown
polarizability: 144.8072876|-1.7651904|136.922854|-10.7396448|-2.1780329|72.3517669 unknown
InChI: InChI=1S/C7H7NO4S/c8-13(11,12)6-4-2-1-3-5(6)7(9)10/h1-4,9H,8H2
charge 0 multiplicity 1
20 atoms
S  1.608995 1.105187 0.017937
O  1.658483 2.71182 0.272773
O  2.405305 0.118346 1.035734
O  1.285865 -1.762049 -0.951858
O  -0.169666 -3.073462 0.286817
N  2.059951 0.917612 -1.727805
C  -0.245569 0.612993 -0.043129
C  -0.709257 -0.723367 -0.058664
C  -1.107285 1.714317 0.055803
C  -2.111472 -0.928722 0.05701
C  -2.499818 1.485136 0.140359
C  -2.998189 0.162821 0.148973
C  0.127878 -1.953843 -0.180171
H  -0.681569 2.723208 0.089993
H  -2.47949 -1.959599 0.070041
H  -3.184661 2.335962 0.213236
H  -4.074688 -0.017628 0.230874
H  2.884812 1.498901 -1.938982
H  2.134722 -0.085467 -1.95657
H  1.848751 -2.580466 -0.897773
