program: Orca
programVersion: 5.0.2
elementType: Cl Cl F O O O N C C C C C C C C C C C C C C C C C C C C C C C C C C C C H H H H H H H H H H H H H H H H H H H H H H
charge: 0
multiplicity: 1
keywords: wb97x-d3
keywords: def2-TZVPP
keywords: def2/J RIJCOSX
keywords: DEFGRID2
keywords: scfconv7
keywords: smallprint printgap noloewdin
keywords: NOSOSCF
formula: C28H22Cl2FNO3
InChI: InChI=1/C28H22Cl2FNO3/c1-28(2)21(15-22(30)17-8-11-19(29)12-9-17)26(28)27(33)35-25(16-32)18-10-13-23(31)24(14-18)34-20-6-4-3-5-7-20/h3-15,21,25-26H,1-2H3
57 atoms
Cl 1.656475 3.412346 0.474537
Cl 8.344486 4.422308 2.05603
F  -5.808928 -3.113349 -1.766326
O  -1.71574 0.716981 1.129341
O  -1.37248 1.177683 -1.030365
O  -3.715307 -3.761878 -0.133071
N  -4.091431 1.154356 3.363044
C  1.081082 -0.788082 -0.345274
C  1.523706 0.59856 -0.677057
C  0.437247 0.410437 0.344968
C  1.943199 -1.649328 0.543586
C  0.308593 -1.571703 -1.377114
C  2.831995 1.136667 -0.24623
C  -0.939892 0.817283 0.032893
C  3.020108 2.343427 0.287066
C  -3.098253 0.966338 0.952672
C  4.312632 2.877757 0.74144
C  -3.804911 -0.138156 0.198092
C  5.273513 2.01253 1.268023
C  4.620787 4.234829 0.651378
C  -3.641384 1.07065 2.309647
C  6.513414 2.47891 1.668669
C  5.856767 4.714344 1.051629
C  -3.400631 -1.460567 0.343804
C  -4.877241 0.176743 -0.621023
C  6.7981 3.830494 1.553726
C  -4.074106 -2.464207 -0.328022
C  -5.564126 -0.826264 -1.289756
C  -5.159112 -2.13265 -1.133053
C  -3.305555 -4.519326 -1.199416
C  -2.789914 -3.970017 -2.364812
C  -3.400677 -5.896071 -1.043166
C  -2.380854 -4.819141 -3.385532
C  -2.982085 -6.728578 -2.068709
C  -2.47564 -6.195779 -3.247615
H  1.181654 0.969818 -1.640945
H  0.714367 0.530078 1.386652
H  2.463976 -1.07387 1.310002
H  2.694676 -2.180509 -0.043964
H  1.334014 -2.39868 1.052635
H  -0.282105 -0.941321 -2.039786
H  -0.364448 -2.286072 -0.898771
H  0.998603 -2.140986 -2.002822
H  3.710142 0.519193 -0.403764
H  -3.270475 1.926989 0.454701
H  5.050697 0.96048 1.389294
H  3.899295 4.93772 0.256812
H  -2.567594 -1.73076 0.981599
H  7.242315 1.792756 2.078356
H  6.078232 5.769685 0.967346
H  -5.187175 1.206828 -0.742634
H  -6.406967 -0.592911 -1.926935
H  -2.697605 -2.898094 -2.489869
H  -3.803169 -6.307713 -0.125867
H  -1.983383 -4.391128 -4.29677
H  -3.061375 -7.801209 -1.946318
H  -2.157178 -6.848317 -4.04974
elementType: Cl F O N C H
totalener: -2381.01302225 hartree
nucrepener: 3733.18466919 hartree
electener: -6114.19769144 hartree
twoeener: 4571.41049960 hartree
cpcmener: -0.03713545 hartree
kineticenergy: 2373.49737681 hartree
xcener: -182.582531692132 hartree
chargesum: 0.0000000
charge: -0.106558 -0.091604 -0.206967 -0.280595 -0.428339 -0.323213 -0.086400 0.148035 -0.034437 -0.136569 -0.280420 -0.290846 -0.186883 0.371165 0.129043 0.402147 0.041490 0.002269 -0.201228 -0.171292 -0.227440 -0.149739 -0.164459 -0.207986 -0.161913 0.109162 0.148685 -0.160398 0.271582 0.308274 -0.203287 -0.246286 -0.162273 -0.122977 -0.183215 0.109498 0.112008 0.091700 0.102256 0.100913 0.097504 0.092693 0.105240 0.141431 0.145344 0.146937 0.137475 0.144209 0.142680 0.142708 0.147967 0.152700 0.152683 0.144844 0.157768 0.156945 0.157967
qa: -0.1066 -0.0916 -0.2070 -0.2806 -0.4283 -0.3232 -0.0864 0.1480 -0.0344 -0.1366 -0.2804 -0.2908 -0.1869 0.3712 0.1290 0.4021 0.0415 0.0023 -0.2012 -0.1713 -0.2274 -0.1497 -0.1645 -0.2080 -0.1619 0.1092 0.1487 -0.1604 0.2716 0.3083 -0.2033 -0.2463 -0.1623 -0.1230 -0.1832 0.1095 0.1120 0.0917 0.1023 0.1009 0.0975 0.0927 0.1052 0.1414 0.1453 0.1469 0.1375 0.1442 0.1427 0.1427 0.1480 0.1527 0.1527 0.1448 0.1578 0.1569 0.1580
va: 1.2304 1.2139 1.0850 2.1106 2.0808 2.0737 3.1131 3.7299 3.8825 3.7944 3.9106 3.8961 3.8322 4.2005 3.8119 3.7163 3.6243 3.6355 4.0007 3.9894 4.0716 3.9970 4.0274 3.9734 3.9608 3.8484 3.7850 3.9083 3.9729 3.6384 3.8677 3.9994 3.9246 3.8971 3.9040 1.0249 1.0262 1.0021 1.0001 1.0038 1.0135 0.9995 1.0036 0.9988 1.0153 1.0011 1.0238 1.0211 1.0074 1.0077 0.9998 0.9976 1.0017 1.0090 0.9912 0.9893 0.9900
dispcorr: -0.031834525 hartree
energy: -2381.044856777696
dipole: -4.56879 5.73701 1.16822 -29.06549 28.12631 -0.93918 -13.72773 12.10014 -1.62759
magnitude: 2.21266 au
magnitude: 5.62413 debye
