program: Gaussian 09
title: 000069435
version: EM64L-G09RevD.01
frameworkgroup: C1[X(C4H9NO3)]
method: RPBEPBE
basis: SDD
operation: Freq
keyword: #pfreq=noraman
keyword: PBEPBE/SDD
title: #p freq=noraman PBEPBE/SDD
converged: YES YES NO NO
title: Mulliken charges:
elementType: O O O N C C C C H H H H H H H H H
charge: -0.458378 -0.432266 -0.215582 -0.588415 -0.031764 -0.179728 -0.720589 0.190634 0.243408 0.218829 0.218348 0.220837 0.226015 0.310240 0.275197 0.343772 0.379442
chargesum: 0.00000
title: Mulliken charges with hydrogens summed into heavy atoms:
elementType: O O O N C C C C
charge: -0.114606 -0.052824 -0.215582 -0.002979 0.187065 0.063680 -0.055388 0.190634
polarizability: 6.77786563e+01 -1.13524333e-01 5.88910857e+01 4.62742022e+00 3.85921015e+00 5.36682846e+01
1716.lowfreq: -18.0003 -0.0008 -0.0007 -0.0006 0.8770 9.0019 58.0663 81.2616 144.8744
frequency: 58.0265 81.2581 144.8518 170.9119 227.4336 241.3372 254.1379 292.5063 334.8831 408.5404 435.3980 497.6252 551.4516 591.2653 642.3972 689.5867 793.2578 836.0700 913.6799 1005.9950 1035.5637 1054.7018 1091.8951 1116.4986 1152.2158 1233.4258 1247.0461 1293.4173 1322.6861 1345.5622 1378.4160 1386.1986 1465.2513 1474.3929 1621.0366 1689.7891 2973.6809 2978.5696 3006.4138 3066.9953 3082.4134 3496.5662 3520.6820 3573.7499 3634.2278
redmass: 4.0432 7.8770 1.6582 2.1054 1.3391 2.4304 1.0918 2.4790 2.7535 3.2686 4.0956 1.5126 1.8490 2.9270 2.1235 3.3250 4.1491 2.9068 2.3893 1.4967 2.8437 2.4017 2.0229 1.4846 1.3985 1.5084 1.7190 1.4938 1.3659 1.5094 1.3311 1.4577 1.0485 1.0555 1.1948 5.4436 1.0513 1.0684 1.0842 1.0986 1.0994 1.0445 1.0641 1.0664 1.0995
irintensity: 0.9965 1.0595 22.5673 38.7665 7.2584 27.6070 116.4255 10.8126 25.0194 5.7041 32.6934 240.2579 49.8890 28.4308 196.8421 11.2160 14.6986 11.2808 7.1624 4.8584 286.8667 62.2906 19.6431 3.9664 22.2051 0.9759 7.2221 35.2661 15.4629 9.0588 5.3201 22.8159 11.8726 9.4357 105.7797 188.1315 29.1443 22.1790 29.6466 31.1587 33.1585 9.8738 22.0276 4.2503 9.6710
temp: 298.150 k
press: 1.00000 atm
elementType: 8 8 8 7 6 6 6 6 1 1 1 1 1 1 1 1 1
symmnumber: 1
zpe: 355362.7 jmol-1
zpe.correction: 0.135351 hartree
zpe.thermalcorrener: 0.145210 hartree
zpe.thermalcorrenthalpy: 0.146154 hartree
zpe.thermalcorrgfe: 0.100722 hartree
zpe.sumelectzpe: -437.580221 hartree
zpe.sumelectthermal: -437.570361 hartree
zpe.sumelectthermalent: -437.569417 hartree
zpe.sumelectthermalfe: -437.614849 hartree
dipole: -3.2730 -2.2499 -0.9731
dipole: 4.0892
quadrupole: -43.0907 -46.3031 -49.1432
quadrupole: -5.2571 -2.7907 -1.8577
quadrupole: 3.0883 -0.1241 -2.9642 -5.2571 -2.7907 -1.8577
hfenergy: -437.7155712 hartree
pointgroup: C01 [X(C4H9N1O3)]
dipole: 1.2995847 0.8385711 -0.4428513 debye
dipolederiv: -0.4275674 0.20305 0.0154476 0.2083359 -0.3843927 -0.0788053 -0.0068052 -0.101069 -0.8092929 -0.4449946 0.236661 -0.2126041 0.2250046 -1.013546 0.3293362 -0.1721606 0.2733013 -0.5100792 -0.7204574 -0.1668343 0.2726249 0.0625825 -0.6079709 0.1577968 0.2291232 0.3180798 -0.5735159 -0.5471001 -0.2013681 -0.1948739 -0.2359566 -0.8257534 -0.0403161 -0.1826669 -0.0879523 -0.3453532 0.3938335 -0.1187494 -0.0018509 0.0106089 0.1467213 0.0542241 0.0175238 0.0482957 0.6454432 -0.0796824 0.0255019 0.1437786 0.0439625 0.5927015 -0.0114003 0.2446624 -0.0971268 0.1963378 -0.1984781 0.0700671 0.1061893 -0.0086159 0.0236399 -0.0266446 0.0070191 -0.0400183 -0.0275491 1.0633492 -0.1249728 -0.2439157 -0.3426272 1.1528339 -0.4980113 -0.3072812 -0.5720748 0.7332422 0.0833214 -0.0134586 0.0125058 0.0058274 0.0115692 0.025319 -0.0144148 0.0486779 -0.1209672 0.0224472 0.0287755 -0.0215572 0.0446579 -0.162893 0.0819165 -0.0059919 0.0461915 -0.0629204 -0.0699183 -0.0976351 -0.0275103 -0.1307957 -0.0286453 -0.0579649 -0.0610135 -0.0647505 0.0716154 0.0925052 0.0134862 -0.007999 0.0180229 0.099205 -0.0278468 0.0349107 -0.0203016 -0.1593136 0.0855179 0.0319203 0.0061083 0.1131759 -0.0849225 0.0668746 -0.0289862 0.0870419 0.0580482 0.3274413 0.0789341 0.0004806 0.0801271 0.2484331 -0.0278968 0.024399 0.0440679 0.1038239 0.0943108 0.1806623 0.1150076 0.09531 0.2728169 0.0639581 0.0784474 0.1202228 0.2206642 0.1533341 -0.1902351 -0.0807206 -0.1929068 0.225223 -0.0300453 -0.0192517 -0.0011889 0.2887041 0.1721377 0.0441949 0.118889 0.0032866 0.3349801 0.0195062 0.1624867 -0.0013964 0.2911123 unknown
polarizability: 67.3376098|-0.6001042|58.8637537|-5.3251569|-3.7095477|54.1366631 unknown
InChI: InChI=1S/C4H9NO3/c1-2(6)3(5)4(7)8/h2-3,6-7H,5H2,1H3
charge 0 multiplicity 1
17 atoms
O  1.073226 0.615289 1.379924
O  -1.608861 1.313491 -0.644849
O  -2.011295 -0.458339 0.803518
N  0.23392 -1.804751 -0.14491
C  1.180657 0.592758 -0.092102
C  0.071286 -0.417815 -0.557963
C  2.585603 0.173691 -0.549729
C  -1.277402 0.088465 -0.040231
H  0.041856 -0.355058 -1.663403
H  0.92419 1.589642 -0.508285
H  3.340925 0.919002 -0.236539
H  2.638402 0.091593 -1.65169
H  2.864564 -0.798812 -0.105462
H  0.026167 -1.971055 0.842589
H  1.071147 -2.275587 -0.490253
H  1.766021 1.215563 1.753091
H  -2.468607 1.638923 -0.263706
