program: Gaussian 09
title: 000069434
version: EM64L-G09RevD.01
frameworkgroup: C1[X(C10H13ClO3S)]
method: RPBEPBE
basis: SDD
operation: Freq
keyword: #p
keyword: freq=noraman
keyword: PBEPBE/SDD
title: #p freq=noraman PBEPBE/SDD
converged: YES YES NO NO
title: Mulliken charges:
elementType: Cl S O O O C C C C C C C C C C H H H H H H H H H H H H H
charge: -0.081310 0.989612 -0.426330 -0.509408 -0.505637 -0.040389 -0.222671 -0.362895 -0.240532 -0.237739 0.451481 -0.357636 -0.359513 -0.566535 -0.796782 0.243342 0.233091 0.237095 0.226401 0.285744 0.283833 0.247220 0.246467 0.287795 0.266049 0.231256 0.231970 0.246023
chargesum: 0.00000
title: Mulliken charges with hydrogens summed into heavy atoms:
elementType: Cl S O O O C C C C C C C C C C
charge: -0.081310 0.989612 -0.426330 -0.509408 -0.505637 -0.040389 0.253761 0.100602 0.045212 0.046093 0.451481 -0.110417 -0.113046 -0.012692 -0.087534
polarizability: 1.94270042e+02 2.36052707e+01 1.34420575e+02 1.32108134e+01 -1.31786928e+01 1.35282393e+02
1716.lowfreq: -33.8669 -17.8381 -13.3910 -4.4057 -0.0035 -0.0033 -0.0027 7.0090 17.8123
frequency: -33.2881 -14.6753 17.3047 35.4584 40.2833 61.4422 107.3360 126.9222 154.0053 179.5678 203.2232 230.9941 245.1152 305.3967 308.7356 315.1362 382.3806 384.0526 406.6176 430.4866 469.3834 503.5492 571.1506 595.6756 611.5263 619.9440 704.4491 777.8008 789.4015 826.1735 833.7859 848.7975 876.7612 889.9139 956.7778 963.8213 983.5676 990.6344 993.9873 997.6410 1042.5638 1049.4750 1053.2686 1105.1379 1119.9978 1149.2491 1181.3462 1185.5688 1217.6468 1260.2497 1297.6561 1299.0440 1355.9617 1361.5485 1381.3502 1392.1627 1399.2204 1430.1958 1446.3033 1470.6109 1472.6122 1473.5183 1479.5121 1594.4199 1595.0875 2982.0307 2989.5403 2995.0459 3052.7887 3064.8539 3065.8487 3070.3489 3094.2242 3139.0762 3140.5206 3151.3271 3164.3892 3167.3486
redmass: 1.0167 7.3419 5.2009 6.2745 4.2177 8.7424 4.0033 7.2540 3.1885 4.5689 3.9986 8.0096 7.2905 4.6418 3.0425 4.2033 4.1887 4.2154 2.8643 3.5593 7.0263 3.1209 4.7142 6.1618 5.2963 6.9556 3.3313 4.8106 1.7261 1.6607 4.7167 1.2438 2.6197 2.6612 11.3237 1.2977 1.4108 1.4273 5.4143 1.8913 1.5324 1.6083 2.4791 2.2575 1.2904 1.2507 1.1040 1.1344 3.1084 1.1822 1.2624 1.1799 1.2477 1.5471 5.6907 3.1040 1.2190 1.0854 1.0967 1.1026 2.0442 1.1310 1.0774 5.9782 6.9120 1.0390 1.0590 1.0582 1.0945 1.0947 1.0770 1.0926 1.1002 1.0892 1.0895 1.1114 1.0958 1.0971
irintensity: 0.6083 1.3255 0.2479 0.6041 1.1541 1.2460 0.4803 1.8494 6.6376 8.6368 8.1513 5.9172 4.4020 3.3438 4.3100 3.9532 5.2536 1.5990 0.0068 13.3621 98.9678 47.2349 70.2086 55.2385 55.1041 0.1394 0.9965 3.0697 8.2120 103.5042 31.4917 0.2366 101.5666 13.0584 69.6893 1.1374 1.2278 3.9683 1.1573 52.8840 5.4244 25.8712 22.2823 0.6728 7.0055 10.8950 4.7877 9.5281 6.4786 16.5692 2.2477 17.0192 6.7826 7.1346 0.1776 11.5357 17.4389 16.0781 12.4415 17.7032 19.3945 14.9627 29.3666 15.5584 0.1527 20.6310 10.8797 37.7184 11.7489 16.4492 18.9073 21.1884 14.1229 12.9957 5.4566 11.6246 0.3991 9.1482
temp: 298.150 k
press: 1.00000 atm
elementType: 17 16 8 8 8 6 6 6 6 6 6 6 6 6 6 1 1 1 1 1 1 1 1 1 1 1 1 1
symmnumber: 1
zpe: 554051.9 jmol-1
zpe.correction: 0.211027 hartree
zpe.thermalcorrener: 0.226232 hartree
zpe.thermalcorrenthalpy: 0.227176 hartree
zpe.thermalcorrgfe: 0.165752 hartree
zpe.sumelectzpe: -1471.339946 hartree
zpe.sumelectthermal: -1471.324741 hartree
zpe.sumelectthermalent: -1471.323797 hartree
zpe.sumelectthermalfe: -1471.385221 hartree
dipole: -4.0690 -3.5914 -3.5266
dipole: 6.4724
quadrupole: -86.7242 -112.3204 -102.5590
quadrupole: 11.1129 -7.4412 -2.8931
quadrupole: 13.8103 -11.7859 -2.0245 11.1129 -7.4412 -2.8931
hfenergy: -1471.5509729 hartree
pointgroup: C01 [X(C10H13Cl1O3S1)]
dipole: -1.6731662 -1.2300978 -1.473682 debye
polarizability: 197.0877408|18.1357026|131.5166052|14.4401038|-13.8235298|135.3686638 unknown
InChI: InChI=1S/C10H13ClO3S/c1-9-3-5-10(6-4-9)15(12,13)14-8-2-7-11/h3-6H,2,7-8H2,1H3
charge 0 multiplicity 1
28 atoms
Cl 4.593036 -2.073488 0.806789
S  0.520009 1.465456 0.548964
O  1.614353 0.299728 -0.419727
O  0.516205 2.895844 -0.213851
O  0.920869 1.376033 2.116397
C  -1.082102 0.555374 0.232957
C  3.054298 0.665593 -0.345255
C  3.766947 -0.334993 -1.265106
C  -1.47627 -0.428921 1.152931
C  -1.830676 0.909242 -0.900232
C  -3.49734 -0.779063 -0.219803
C  -2.697846 -1.093974 0.911661
C  -3.047755 0.227442 -1.116145
C  3.647742 -1.791074 -0.814809
C  -4.822442 -1.481627 -0.448335
H  3.412733 0.575333 0.696883
H  3.197379 1.699788 -0.711666
H  4.832439 -0.046516 -1.340609
H  3.32979 -0.256252 -2.280866
H  -0.858877 -0.654655 2.028081
H  -1.481025 1.695207 -1.576873
H  -3.032313 -1.867885 1.611608
H  -3.65463 0.480338 -1.992836
H  2.607961 -2.072758 -0.597307
H  4.106298 -2.486824 -1.532482
H  -5.075322 -1.53341 -1.521296
H  -4.81207 -2.509434 -0.046607
H  -5.644793 -0.939504 0.057434
