program: Orca
programVersion: 5.0.2
elementType: Cl Cl F O O O N C C C C C C C C C C C C C C C C C C C C C C C C C C C C H H H H H H H H H H H H H H H H H H H H H H
charge: 0
multiplicity: 1
keywords: wb97x-d3
keywords: def2-TZVPP
keywords: def2/J RIJCOSX
keywords: DEFGRID2
keywords: scfconv7
keywords: smallprint printgap noloewdin
keywords: NOSOSCF
formula: C28H22Cl2FNO3
InChI: InChI=1/C28H22Cl2FNO3/c1-28(2)21(15-22(30)17-8-11-19(29)12-9-17)26(28)27(33)35-25(16-32)18-10-13-23(31)24(14-18)34-20-6-4-3-5-7-20/h3-15,21,25-26H,1-2H3
57 atoms
Cl 0.648357 0.908319 1.326594
Cl 7.305643 -0.468497 -0.000693
F  -4.258286 -4.373809 -1.646538
O  -2.635824 1.410793 -0.267065
O  -2.774986 3.225291 1.02165
O  -1.829995 -3.511034 -1.082161
N  -3.159781 0.502038 2.985143
C  -0.570922 4.431657 -0.893308
C  0.11916 3.653275 0.170284
C  -1.017896 3.010158 -0.610219
C  0.116482 4.61582 -2.225614
C  -1.425395 5.608878 -0.493624
C  1.473167 3.079641 0.02261
C  -2.220873 2.62359 0.137261
C  1.834116 1.89172 0.505477
C  -3.692178 0.78466 0.436558
C  3.175383 1.298867 0.402363
C  -3.857895 -0.59809 -0.143028
C  4.308239 2.099487 0.542817
C  3.34604 -0.060833 0.144113
C  -3.3737 0.665444 1.868267
C  5.579814 1.5638 0.415681
C  4.610498 -0.607358 0.013123
C  -2.730884 -1.394804 -0.32376
C  -5.116519 -1.071671 -0.471135
C  5.721096 0.21136 0.150074
C  -2.865859 -2.67558 -0.828998
C  -5.257307 -2.354494 -0.985265
C  -4.139291 -3.137425 -1.153962
C  -0.677589 -3.430038 -0.339474
C  0.52392 -3.443604 -1.030763
C  -0.703716 -3.400836 1.048922
C  1.716509 -3.436255 -0.320338
C  0.496053 -3.375138 1.744893
C  1.708315 -3.394313 1.066967
H  -0.148064 3.926535 1.188906
H  -0.711509 2.282618 -1.352751
H  0.797994 5.468475 -2.19274
H  -0.61827 4.810177 -3.008939
H  0.692408 3.740347 -2.52822
H  -0.82375 6.519519 -0.519181
H  -1.8380 5.519242 0.508452
H  -2.254349 5.743556 -1.190521
H  2.225854 3.651463 -0.510514
H  -4.622892 1.353005 0.347397
H  4.205061 3.151632 0.774687
H  2.487725 -0.709895 0.03063
H  -1.746607 -1.018112 -0.072372
H  6.447909 2.197479 0.537699
H  4.723642 -1.662892 -0.195404
H  -5.991428 -0.450522 -0.331267
H  -6.231774 -2.74332 -1.25027
H  0.525515 -3.469152 -2.113268
H  -1.643731 -3.40035 1.587088
H  2.655361 -3.455785 -0.859344
H  0.478932 -3.348753 2.826863
H  2.639919 -3.378743 1.617287
elementType: Cl F O N C H
totalener: -2381.01156575 hartree
nucrepener: 3933.63617060 hartree
electener: -6314.64773635 hartree
twoeener: 4772.53236327 hartree
cpcmener: -0.03817465 hartree
kineticenergy: 2373.49402962 hartree
xcener: -182.583669317901 hartree
chargesum: 0.0000000
charge: -0.114946 -0.090476 -0.207701 -0.273493 -0.438354 -0.322622 -0.086436 0.155590 -0.066877 -0.121874 -0.283233 -0.277163 -0.159704 0.375165 0.104971 0.424596 0.079068 -0.011211 -0.205666 -0.174150 -0.241940 -0.155451 -0.147098 -0.156532 -0.180271 0.104802 0.185722 -0.154392 0.188015 0.274479 -0.230093 -0.188955 -0.120208 -0.136406 -0.192013 0.115798 0.103669 0.101849 0.099315 0.093529 0.094578 0.095381 0.100419 0.142637 0.132384 0.149827 0.127456 0.126193 0.142664 0.137552 0.148052 0.150868 0.146509 0.157678 0.161341 0.159588 0.157569
qa: -0.1149 -0.0905 -0.2077 -0.2735 -0.4384 -0.3226 -0.0864 0.1556 -0.0669 -0.1219 -0.2832 -0.2772 -0.1597 0.3752 0.1050 0.4246 0.0791 -0.0112 -0.2057 -0.1741 -0.2419 -0.1555 -0.1471 -0.1565 -0.1803 0.1048 0.1857 -0.1544 0.1880 0.2745 -0.2301 -0.1890 -0.1202 -0.1364 -0.1920 0.1158 0.1037 0.1018 0.0993 0.0935 0.0946 0.0954 0.1004 0.1426 0.1324 0.1498 0.1275 0.1262 0.1427 0.1376 0.1481 0.1509 0.1465 0.1577 0.1613 0.1596 0.1576
va: 1.2337 1.2166 1.0846 2.1450 2.0624 2.0877 3.1083 3.7136 3.8991 3.8308 3.9152 3.8840 3.8354 4.1777 3.7939 3.7552 3.5772 3.7536 3.9813 3.9884 4.0228 3.9928 3.9954 3.9334 3.9169 3.8749 3.7589 3.8852 4.0565 3.7004 4.0036 3.9203 3.8190 3.8673 3.8570 1.0236 1.0259 0.9995 1.0031 1.0008 1.0010 1.0185 0.9991 0.9953 1.0147 1.0030 1.0237 1.0308 1.0070 1.0123 1.0014 0.9982 1.0070 0.9955 0.9881 0.9895 0.9921
dispcorr: -0.033958011 hartree
energy: -2381.045523762570
dipole: -5.92197 6.22850 0.30653 25.99726 -24.57631 1.42095 -7.59527 5.44224 -2.15303
magnitude: 2.59781 au
magnitude: 6.60310 debye
