program: Orca
programVersion: 5.0.2
elementType: Cl Cl F O O O N C C C C C C C C C C C C C C C C C C C C C C C C C C C C H H H H H H H H H H H H H H H H H H H H H H
charge: 0
multiplicity: 1
keywords: wb97x-d3
keywords: def2-TZVPP
keywords: def2/J RIJCOSX
keywords: DEFGRID2
keywords: scfconv7
keywords: smallprint printgap noloewdin
keywords: NOSOSCF
formula: C28H22Cl2FNO3
InChI: InChI=1/C28H22Cl2FNO3/c1-28(2)21(15-22(30)17-8-11-19(29)12-9-17)26(28)27(33)35-25(16-32)18-10-13-23(31)24(14-18)34-20-6-4-3-5-7-20/h3-15,21,25-26H,1-2H3
57 atoms
Cl 0.916437 0.581278 2.08732
Cl 7.079365 -0.794356 -0.803642
F  -2.614174 -3.995644 -0.704637
O  -3.24591 2.151266 0.051438
O  -3.170719 1.978226 -2.171573
O  -1.312004 -2.41904 1.094684
N  -5.42436 1.563026 2.454199
C  -0.825732 4.015282 -0.150143
C  -0.39968 2.604515 0.136371
C  -1.301965 2.902746 -1.058074
C  0.15421 4.980712 -0.774289
C  -1.755886 4.686601 0.831964
C  0.9483 2.0925 -0.123472
C  -2.652856 2.323658 -1.140397
C  1.629498 1.22608 0.629975
C  -4.35499 1.264611 0.08944
C  2.980113 0.731279 0.320871
C  -3.911411 -0.165414 -0.112632
C  3.389502 -0.55154 0.682718
C  3.880566 1.53997 -0.376445
C  -4.942465 1.445642 1.418713
C  4.645219 -1.025319 0.340711
C  5.135977 1.076736 -0.727945
C  -2.810061 -0.644376 0.591449
C  -4.563073 -0.978449 -1.024944
C  5.509612 -0.208817 -0.368651
C  -2.367592 -1.935506 0.383808
C  -4.133764 -2.282912 -1.227355
C  -3.045554 -2.745178 -0.52253
C  -0.161733 -2.747129 0.423007
C  0.190542 -2.173228 -0.791385
C  0.665653 -3.679688 1.034379
C  1.374887 -2.562472 -1.403289
C  1.847411 -4.052789 0.412192
C  2.203638 -3.505625 -0.813709
H  -0.904795 2.160066 0.984738
H  -0.814408 2.880525 -2.026254
H  0.767281 4.526534 -1.55184
H  0.82382 5.388419 -0.014632
H  -0.379552 5.81733 -1.228555
H  -2.437544 5.367338 0.318569
H  -1.16915 5.280614 1.535071
H  -2.349783 3.990845 1.419186
H  1.433141 2.421005 -1.035648
H  -5.118318 1.536455 -0.646598
H  2.725176 -1.208425 1.228037
H  3.614083 2.55546 -0.638682
H  -2.281755 -0.023002 1.305221
H  4.936759 -2.027817 0.623722
H  5.81818 1.721099 -1.26592
H  -5.409083 -0.601959 -1.585132
H  -4.636605 -2.93089 -1.933109
H  -0.437127 -1.428059 -1.264381
H  0.380416 -4.113487 1.984903
H  1.649112 -2.114506 -2.349696
H  2.487354 -4.784791 0.888105
H  3.124063 -3.803286 -1.298311
elementType: Cl F O N C H
totalener: -2381.01146740 hartree
nucrepener: 4031.61993440 hartree
electener: -6412.63140180 hartree
twoeener: 4869.86303683 hartree
cpcmener: -0.03741726 hartree
kineticenergy: 2373.49150037 hartree
xcener: -182.585164014733 hartree
chargesum: 0.0000000
charge: -0.115471 -0.093307 -0.206591 -0.281666 -0.430043 -0.319237 -0.083681 0.076805 0.032465 -0.051548 -0.272183 -0.263585 -0.135040 0.358651 0.009739 0.384024 0.138416 -0.036749 -0.220850 -0.224682 -0.229573 -0.144981 -0.143044 -0.158714 -0.144080 0.104074 0.119355 -0.165481 0.283325 0.241032 -0.150383 -0.218457 -0.155834 -0.120047 -0.197272 0.089884 0.094821 0.089245 0.101426 0.101277 0.102181 0.095044 0.093021 0.132024 0.141149 0.139620 0.145185 0.140276 0.140663 0.141494 0.150222 0.152564 0.151821 0.143733 0.157078 0.155369 0.156516
qa: -0.1155 -0.0933 -0.2066 -0.2817 -0.4300 -0.3192 -0.0837 0.0768 0.0325 -0.0515 -0.2722 -0.2636 -0.1350 0.3587 0.0097 0.3840 0.1384 -0.0367 -0.2208 -0.2247 -0.2296 -0.1450 -0.1430 -0.1587 -0.1441 0.1041 0.1194 -0.1655 0.2833 0.2410 -0.1504 -0.2185 -0.1558 -0.1200 -0.1973 0.0899 0.0948 0.0892 0.1014 0.1013 0.1022 0.0950 0.0930 0.1320 0.1411 0.1396 0.1452 0.1403 0.1407 0.1415 0.1502 0.1526 0.1518 0.1437 0.1571 0.1554 0.1565
va: 1.2156 1.2133 1.0867 2.1128 2.0782 2.0638 3.1073 3.7825 3.8178 3.8281 3.9195 3.9032 3.8030 4.2103 3.8759 3.7752 3.5194 3.6836 3.9637 4.0263 4.0667 4.0001 3.9829 3.9683 3.9271 3.8675 3.8274 3.9131 3.9805 3.6316 3.7994 3.9757 3.8471 3.8759 3.8482 1.0277 1.0286 1.0068 1.0003 1.0010 1.0003 1.0001 1.0115 1.0061 1.0138 1.0142 1.0044 1.0209 1.0105 1.0068 0.9990 0.9977 1.0028 1.0090 0.9918 0.9899 0.9909
dispcorr: -0.037365801 hartree
energy: -2381.048833203882
dipole: -6.87686 7.44349 0.56662 23.15084 -21.91667 1.23417 -7.33897 5.68005 -1.65892
magnitude: 2.14389 au
magnitude: 5.44933 debye
