program: Orca
programVersion: 5.0.2
elementType: Cl Cl F O O O N C C C C C C C C C C C C C C C C C C C C C C C C C C C C H H H H H H H H H H H H H H H H H H H H H H
charge: 0
multiplicity: 1
keywords: wb97x-d3
keywords: def2-TZVPP
keywords: def2/J RIJCOSX
keywords: DEFGRID2
keywords: scfconv7
keywords: smallprint printgap noloewdin
keywords: NOSOSCF
formula: C28H22Cl2FNO3
InChI: InChI=1/C28H22Cl2FNO3/c1-28(2)21(15-22(30)17-8-11-19(29)12-9-17)26(28)27(33)35-25(16-32)18-10-13-23(31)24(14-18)34-20-6-4-3-5-7-20/h3-15,21,25-26H,1-2H3
57 atoms
Cl 2.086476 1.529318 2.100425
Cl 8.768709 3.25501 1.376853
F  -6.483638 -1.897155 -2.072422
O  -1.105306 -0.078256 0.515972
O  -1.972509 1.952157 0.886865
O  -4.325952 -3.42305 -2.208515
N  -1.176404 -2.795408 2.411328
C  -0.039243 2.852846 -1.406374
C  0.62364 3.073919 -0.0895
C  0.035122 1.716168 -0.398667
C  0.826952 2.670248 -2.630706
C  -1.342689 3.554882 -1.697363
C  2.088095 3.219463 0.048767
C  -1.12361 1.261307 0.390562
C  2.840476 2.589505 0.950409
C  -2.164073 -0.666853 1.261806
C  4.29977 2.725424 1.069665
C  -3.336025 -1.010172 0.378269
C  4.938204 2.699622 2.308211
C  5.07989 2.89958 -0.073092
C  -1.595409 -1.857668 1.897226
C  6.307775 2.866978 2.407657
C  6.450419 3.068258 0.013601
C  -3.257147 -2.092329 -0.491976
C  -4.472996 -0.217294 0.402602
C  7.059354 3.053934 1.258364
C  -4.324161 -2.405215 -1.318354
C  -5.53973 -0.513607 -0.432686
C  -5.460242 -1.599627 -1.276176
C  -3.652874 -4.583775 -1.932808
C  -3.678872 -5.177336 -0.677615
C  -2.977678 -5.182571 -2.985085
C  -3.002266 -6.37088 -0.480115
C  -2.317932 -6.383768 -2.776177
C  -2.320721 -6.97911 -1.523855
H  0.042117 3.653537 0.624227
H  0.742273 0.932271 -0.642428
H  1.0865 3.63745 -3.065811
H  0.29601 2.097999 -3.392455
H  1.756497 2.143861 -2.41085
H  -1.138943 4.519141 -2.166607
H  -1.934919 3.737192 -0.804721
H  -1.950761 2.972683 -2.391798
H  2.58807 3.924691 -0.606671
H  -2.491737 0.008734 2.057726
H  4.36197 2.554234 3.211539
H  4.616317 2.877529 -1.050651
H  -2.36622 -2.708786 -0.516678
H  6.788448 2.852054 3.375769
H  7.042715 3.193279 -0.882048
H  -4.529045 0.63676 1.063301
H  -6.437624 0.089155 -0.425889
H  -4.216669 -4.718645 0.142003
H  -2.976764 -4.708646 -3.957591
H  -3.014385 -6.828498 0.499947
H  -1.792543 -6.850913 -3.598488
H  -1.796949 -7.911178 -1.361751
totalener: -2380.98360466 hartree
nucrepener: 3679.05530207 hartree
electener: -6060.03890673 hartree
twoeener: 4517.55777197 hartree
kineticenergy: 2373.56024196 hartree
xcener: -182.591641349037 hartree
chargesum: 0.0000000
charge: -0.077467 -0.070079 -0.182758 -0.256947 -0.391636 -0.288016 -0.003659 0.098641 -0.024074 -0.146821 -0.261525 -0.255539 -0.216728 0.382351 0.139268 0.331241 0.052208 -0.012581 -0.140263 -0.185628 -0.265242 -0.145554 -0.133579 -0.187458 -0.110727 0.098116 0.167015 -0.153119 0.190048 0.257543 -0.173269 -0.215197 -0.100954 -0.086809 -0.145439 0.109568 0.103626 0.093467 0.098138 0.080814 0.085770 0.102195 0.089687 0.118834 0.120731 0.121196 0.121775 0.134478 0.122232 0.120735 0.123221 0.126916 0.133411 0.125884 0.129796 0.125418 0.126745
qa: -0.0775 -0.0701 -0.1828 -0.2569 -0.3916 -0.2880 -0.0037 0.0986 -0.0241 -0.1468 -0.2615 -0.2555 -0.2167 0.3824 0.1393 0.3312 0.0522 -0.0126 -0.1403 -0.1856 -0.2652 -0.1456 -0.1336 -0.1875 -0.1107 0.0981 0.1670 -0.1531 0.1900 0.2575 -0.1733 -0.2152 -0.1010 -0.0868 -0.1454 0.1096 0.1036 0.0935 0.0981 0.0808 0.0858 0.1022 0.0897 0.1188 0.1207 0.1212 0.1218 0.1345 0.1222 0.1207 0.1232 0.1269 0.1334 0.1259 0.1298 0.1254 0.1267
va: 1.2636 1.2369 1.1201 2.1270 2.1104 2.1245 3.1158 3.7506 3.8389 3.8701 3.9144 3.9070 3.8315 4.1656 3.8332 3.8314 3.6787 3.7044 4.0117 4.0161 4.0259 4.0405 4.0286 3.9819 3.9219 3.9467 3.7814 3.9222 4.0957 3.7901 3.9504 4.0446 3.9521 3.9310 3.9678 1.0268 1.0271 1.0018 1.0071 1.0041 1.0022 1.0206 1.0019 1.0068 1.0217 1.0290 1.0076 1.0132 1.0142 1.0148 1.0193 1.0072 1.0024 1.0133 0.9997 0.9989 1.0002
dispcorr: -0.029669967 hartree
energy: -2381.013274631572
dipole: -13.69476 13.80535 0.11059 1.21660 -0.21658 1.00002 -17.85842 16.88596 -0.97247
magnitude: 1.39927 au
magnitude: 3.55666 debye
