program: Orca
programVersion: 5.0.2
elementType: Cl Cl F O O O N C C C C C C C C C C C C C C C C C C C C C C C C C C C C H H H H H H H H H H H H H H H H H H H H H H
charge: 0
multiplicity: 1
keywords: wb97x-d3
keywords: def2-TZVPP
keywords: def2/J RIJCOSX
keywords: DEFGRID2
keywords: scfconv7
keywords: smallprint printgap noloewdin
keywords: NOSOSCF
formula: C28H22Cl2FNO3
InChI: InChI=1/C28H22Cl2FNO3/c1-28(2)21(15-22(30)17-8-11-19(29)12-9-17)26(28)27(33)35-25(16-32)18-10-13-23(31)24(14-18)34-20-6-4-3-5-7-20/h3-15,21,25-26H,1-2H3
57 atoms
Cl 3.061525 2.439062 -2.005027
Cl 8.330243 4.42033 2.038721
F  -5.684662 -3.168245 -2.007479
O  -2.257118 0.931935 1.29957
O  -1.641703 1.265734 -0.823378
O  -4.189899 -3.669993 0.211799
N  -4.971351 1.469432 3.115595
C  0.755979 -0.529475 0.324196
C  1.188981 0.849148 -0.09448
C  0.001483 0.686469 0.824317
C  1.553472 -1.287805 1.357558
C  0.146492 -1.427865 -0.723683
C  2.422761 1.466391 0.405269
C  -1.34661 1.00073 0.30743
C  3.318356 2.148441 -0.310153
C  -3.607266 1.132119 0.912752
C  4.561597 2.708567 0.241653
C  -4.164125 -0.028233 0.122591
C  5.277009 2.004784 1.209384
C  5.05081 3.947262 -0.169782
C  -4.353273 1.316582 2.159801
C  6.429074 2.527228 1.771393
C  6.201297 4.479569 0.383888
C  -3.911884 -1.333622 0.528952
C  -4.9208 0.208395 -1.01224
C  6.88681 3.766624 1.355145
C  -4.417535 -2.396003 -0.196916
C  -5.45036 -0.849907 -1.735343
C  -5.196676 -2.138799 -1.321443
C  -3.431011 -4.488745 -0.580879
C  -2.567419 -4.01136 -1.556911
C  -3.536801 -5.851309 -0.337729
C  -1.811799 -4.912939 -2.293687
C  -2.773724 -6.736637 -1.079509
C  -1.908689 -6.27515 -2.062577
H  0.926417 1.108878 -1.113442
H  0.141334 0.914058 1.875727
H  2.406455 -1.784507 0.892224
H  0.934745 -2.056546 1.822416
H  1.934732 -0.653301 2.156864
H  -0.395561 -0.878172 -1.49066
H  -0.538986 -2.145744 -0.268709
H  0.932703 -1.99832 -1.22063
H  2.634299 1.378569 1.465177
H  -3.706995 2.050585 0.323806
H  4.946145 1.01969 1.511577
H  4.524988 4.511577 -0.927806
H  -3.320574 -1.542471 1.41199
H  6.977121 1.964959 2.514474
H  6.564376 5.445135 0.06051
H  -5.098938 1.222039 -1.346265
H  -6.048249 -0.678926 -2.620086
H  -2.473169 -2.950729 -1.751604
H  -4.216616 -6.206393 0.425294
H  -1.14241 -4.53735 -3.056401
H  -2.862344 -7.798205 -0.890323
H  -1.318917 -6.97137 -2.642944
totalener: -2380.98348571 hartree
nucrepener: 3699.77539872 hartree
electener: -6080.75888443 hartree
twoeener: 4537.53446287 hartree
kineticenergy: 2373.56101404 hartree
xcener: -182.590581414147 hartree
chargesum: 0.0000000
charge: -0.087133 -0.071281 -0.183503 -0.263888 -0.350770 -0.298829 0.003306 0.089731 0.031670 -0.077858 -0.252871 -0.275978 -0.169035 0.304396 0.048358 0.305748 0.092733 0.030156 -0.200564 -0.141319 -0.252622 -0.125398 -0.140658 -0.214863 -0.098105 0.089901 0.136534 -0.152857 0.251310 0.299094 -0.196584 -0.204369 -0.140192 -0.093343 -0.140331 0.088436 0.085806 0.099032 0.100293 0.070421 0.103449 0.090362 0.098000 0.099629 0.124079 0.125155 0.121048 0.130482 0.120570 0.121501 0.109825 0.128760 0.131561 0.125249 0.125573 0.125154 0.125028
qa: -0.0871 -0.0713 -0.1835 -0.2639 -0.3508 -0.2988 0.0033 0.0897 0.0317 -0.0779 -0.2529 -0.2760 -0.1690 0.3044 0.0484 0.3057 0.0927 0.0302 -0.2006 -0.1413 -0.2526 -0.1254 -0.1407 -0.2149 -0.0981 0.0899 0.1365 -0.1529 0.2513 0.2991 -0.1966 -0.2044 -0.1402 -0.0933 -0.1403 0.0884 0.0858 0.0990 0.1003 0.0704 0.1034 0.0904 0.0980 0.0996 0.1241 0.1252 0.1210 0.1305 0.1206 0.1215 0.1098 0.1288 0.1316 0.1252 0.1256 0.1252 0.1250
va: 1.2475 1.2354 1.1185 2.1207 2.1544 2.1133 3.1181 3.7732 3.8320 3.8494 3.9100 3.9116 3.8727 4.2937 3.9240 3.8412 3.6621 3.6510 4.0207 4.0058 4.0147 4.0130 4.0332 3.9927 3.9783 3.9471 3.8262 3.9518 4.0342 3.7413 3.8983 4.0322 3.9968 3.9508 3.9668 1.0536 1.0321 1.0021 1.0055 1.0108 1.0131 0.9994 1.0061 1.0157 1.0161 1.0085 1.0266 1.0261 1.0138 1.0136 1.0116 1.0070 1.0054 1.0140 1.0017 0.9986 1.0000
dispcorr: -0.031090899 hartree
energy: -2381.014576606218
dipole: -7.92180 8.66601 0.74421 -25.29123 24.62199 -0.66924 -0.71358 0.03284 -0.68074
magnitude: 1.21043 au
magnitude: 3.07667 debye
