program: Orca
programVersion: 5.0.2
elementType: Cl Cl F O O O N C C C C C C C C C C C C C C C C C C C C C C C C C C C C H H H H H H H H H H H H H H H H H H H H H H
charge: 0
multiplicity: 1
keywords: wb97x-d3
keywords: def2-TZVPP
keywords: def2/J RIJCOSX
keywords: DEFGRID2
keywords: scfconv7
keywords: smallprint printgap noloewdin
keywords: NOSOSCF
formula: C28H22Cl2FNO3
InChI: InChI=1/C28H22Cl2FNO3/c1-28(2)21(15-22(30)17-8-11-19(29)12-9-17)26(28)27(33)35-25(16-32)18-10-13-23(31)24(14-18)34-20-6-4-3-5-7-20/h3-15,21,25-26H,1-2H3
57 atoms
Cl 0.383051 0.191207 1.616951
Cl 7.247831 -0.395067 0.714322
F  -1.568378 -3.634653 1.566394
O  -3.127988 2.04785 -0.168238
O  -2.720006 1.473215 -2.292621
O  -2.157342 -3.291873 -1.058314
N  -5.906893 1.982587 1.618403
C  -0.847677 4.073707 -0.395287
C  -0.364323 2.771985 0.157352
C  -1.127009 2.803745 -1.167937
C  0.131569 5.01615 -1.056857
C  -1.938835 4.805772 0.349636
C  1.034506 2.330835 0.165544
C  -2.394374 2.059871 -1.297791
C  1.495429 1.242116 0.785682
C  -4.146187 1.054152 -0.071948
C  2.903355 0.822848 0.806333
C  -3.53854 -0.244298 0.398266
C  3.268785 -0.522774 0.813591
C  3.917118 1.781208 0.796837
C  -5.131079 1.58312 0.872037
C  4.599575 -0.900492 0.7785
C  5.250587 1.415179 0.761787
C  -3.162501 -1.19603 -0.54316
C  -3.246453 -0.451459 1.740241
C  5.587242 0.070959 0.74866
C  -2.497225 -2.343312 -0.149017
C  -2.588475 -1.601455 2.144789
C  -2.212127 -2.531651 1.197926
C  -0.853589 -3.371267 -1.468593
C  -0.482482 -4.550425 -2.101079
C  0.057485 -2.336613 -1.3105
C  0.809202 -4.690631 -2.57794
C  1.349105 -2.493906 -1.79631
C  1.733518 -3.665448 -2.427576
H  -0.95433 2.396207 0.984686
H  -0.523959 2.67931 -2.059675
H  0.878895 4.503761 -1.6625
H  0.656423 5.611602 -0.308023
H  -0.3967 5.704827 -1.717344
H  -2.568471 5.368929 -0.340885
H  -1.488193 5.519454 1.041091
H  -2.581361 4.150157 0.930131
H  1.757806 2.907769 -0.399079
H  -4.644169 0.916486 -1.036158
H  2.510291 -1.293709 0.839266
H  3.665644 2.83244 0.844771
H  -3.372631 -1.051566 -1.595027
H  4.865259 -1.948378 0.776481
H  6.02355 2.170957 0.7621
H  -3.53891 0.277173 2.485468
H  -2.36583 -1.777924 3.188425
H  -1.206687 -5.346405 -2.213328
H  -0.222417 -1.410862 -0.825299
H  1.095116 -5.611435 -3.068967
H  2.055753 -1.681993 -1.681049
H  2.741517 -3.778901 -2.802316
totalener: -2380.98064543 hartree
nucrepener: 4002.46877205 hartree
electener: -6383.44941748 hartree
twoeener: 4840.17499822 hartree
kineticenergy: 2373.56109891 hartree
xcener: -182.593028823932 hartree
chargesum: 0.0000000
charge: -0.103412 -0.069143 -0.182383 -0.268801 -0.352410 -0.300953 -0.000086 0.084118 -0.041709 -0.033804 -0.277221 -0.238629 -0.095865 0.319240 0.055098 0.295931 0.137397 -0.015349 -0.245872 -0.209557 -0.266177 -0.124902 -0.128271 -0.114368 -0.127161 0.094540 0.105155 -0.211779 0.286747 0.267830 -0.195881 -0.115375 -0.094292 -0.173419 -0.146611 0.090902 0.090655 0.075873 0.100887 0.100508 0.094019 0.087079 0.095116 0.101319 0.128466 0.142801 0.126959 0.134500 0.125434 0.120953 0.122608 0.132694 0.123199 0.101696 0.124377 0.142515 0.124813
qa: -0.1034 -0.0691 -0.1824 -0.2688 -0.3524 -0.3010 -0.0001 0.0841 -0.0417 -0.0338 -0.2772 -0.2386 -0.0959 0.3192 0.0551 0.2959 0.1374 -0.0153 -0.2459 -0.2096 -0.2662 -0.1249 -0.1283 -0.1144 -0.1272 0.0945 0.1052 -0.2118 0.2867 0.2678 -0.1959 -0.1154 -0.0943 -0.1734 -0.1466 0.0909 0.0907 0.0759 0.1009 0.1005 0.0940 0.0871 0.0951 0.1013 0.1285 0.1428 0.1270 0.1345 0.1254 0.1210 0.1226 0.1327 0.1232 0.1017 0.1244 0.1425 0.1248
va: 1.2482 1.2379 1.1211 2.0905 2.1485 2.1136 3.1081 3.8097 3.8450 3.7912 3.9249 3.8998 3.8174 4.2671 3.9104 3.8507 3.5513 3.6491 4.0226 4.0481 4.0173 4.0485 4.0155 3.9497 3.9128 3.9515 3.8741 3.9105 4.0277 3.7938 4.0240 3.8781 3.9606 3.9766 3.9707 1.0380 1.0270 1.0066 1.0005 1.0042 1.0034 1.0019 1.0154 1.0161 1.0166 1.0110 1.0092 1.0262 1.0143 1.0147 1.0168 1.0073 1.0151 1.0381 0.9984 0.9880 1.0013
dispcorr: -0.035694625 hartree
energy: -2381.016340058282
dipole: -6.82091 8.01607 1.19516 23.89962 -22.99809 0.90153 -12.81983 12.53013 -0.28971
magnitude: 1.52483 au
magnitude: 3.87581 debye
