program: Orca
programVersion: 5.0.2
elementType: Cl Cl F O O O N C C C C C C C C C C C C C C C C C C C C C C C C C C C C H H H H H H H H H H H H H H H H H H H H H H
charge: 0
multiplicity: 1
keywords: wb97x-d3
keywords: def2-TZVPP
keywords: def2/J RIJCOSX
keywords: DEFGRID2
keywords: scfconv7
keywords: smallprint printgap noloewdin
keywords: NOSOSCF
formula: C28H22Cl2FNO3
InChI: InChI=1/C28H22Cl2FNO3/c1-28(2)21(15-22(30)17-8-11-19(29)12-9-17)26(28)27(33)35-25(16-32)18-10-13-23(31)24(14-18)34-20-6-4-3-5-7-20/h3-15,21,25-26H,1-2H3
57 atoms
Cl 0.713708 0.28165 2.149204
Cl 7.411712 -0.521292 0.530791
F  -2.467868 -3.955202 1.75579
O  -3.001816 1.775162 -0.317437
O  -2.604065 1.59663 -2.515749
O  -1.760542 -3.330562 -0.736476
N  -6.104792 2.125596 0.814608
C  -0.717723 3.838337 -0.28388
C  -0.262218 2.485143 0.177028
C  -0.972925 2.635606 -1.162546
C  0.287903 4.829181 -0.8238
C  -1.835868 4.506909 0.479506
C  1.136698 2.049428 0.180296
C  -2.264621 1.969837 -1.427353
C  1.681435 1.124466 0.972714
C  -4.140519 0.921741 -0.413675
C  3.091355 0.712423 0.908725
C  -3.789162 -0.417964 0.184344
C  3.461472 -0.627935 1.010835
C  4.090113 1.663439 0.707021
C  -5.235765 1.598542 0.280155
C  4.784857 -1.010895 0.888166
C  5.418026 1.29174 0.585048
C  -2.990265 -1.265795 -0.575885
C  -4.155372 -0.782371 1.470652
C  5.759014 -0.048055 0.674091
C  -2.526859 -2.457079 -0.044131
C  -3.722429 -1.989734 1.998445
C  -2.905675 -2.806998 1.247985
C  -0.68901 -2.878751 -1.458609
C  -0.367754 -3.595892 -2.601401
C  0.083259 -1.794795 -1.061366
C  0.73692 -3.225201 -3.351302
C  1.179813 -1.429972 -1.8292
C  1.512318 -2.139075 -2.973577
H  -0.872566 2.053934 0.960821
H  -0.34073 2.58207 -2.041652
H  1.058072 4.368194 -1.441373
H  0.784632 5.354642 -0.00681
H  -0.21383 5.574278 -1.442466
H  -2.507642 3.804718 0.965041
H  -2.430599 5.140606 -0.180257
H  -1.413135 5.145572 1.256521
H  1.799442 2.481769 -0.561002
H  -4.433639 0.80405 -1.461166
H  2.709389 -1.388205 1.173764
H  3.83203 2.713785 0.6694
H  -2.713504 -0.99766 -1.588698
H  5.056806 -2.054797 0.957492
H  6.183437 2.040723 0.437145
H  -4.781122 -0.136827 2.072521
H  -4.002768 -2.290747 2.998656
H  -0.979106 -4.439957 -2.891284
H  -0.153152 -1.241354 -0.161542
H  0.986553 -3.787487 -4.241208
H  1.780385 -0.585184 -1.518692
H  2.370863 -1.849453 -3.563815
totalener: -2380.98216669 hartree
nucrepener: 3984.79156653 hartree
electener: -6365.77373322 hartree
twoeener: 4822.34438576 hartree
kineticenergy: 2373.56328352 hartree
xcener: -182.594722160002 hartree
chargesum: 0.0000000
charge: -0.089044 -0.068995 -0.181768 -0.266506 -0.348162 -0.291839 0.000805 0.053489 0.071868 -0.069261 -0.263183 -0.240623 -0.167732 0.337791 0.025119 0.296252 0.116724 -0.016836 -0.200783 -0.213053 -0.272239 -0.118147 -0.117942 -0.157855 -0.147071 0.081396 0.157661 -0.144426 0.192416 0.265736 -0.219288 -0.167070 -0.077139 -0.094042 -0.170140 0.087314 0.085777 0.074670 0.098163 0.100243 0.094504 0.094642 0.088692 0.103382 0.136426 0.128741 0.130293 0.155416 0.124805 0.121720 0.126339 0.128679 0.127404 0.117393 0.126035 0.128954 0.124292
qa: -0.0890 -0.0690 -0.1818 -0.2665 -0.3482 -0.2918 0.0008 0.0535 0.0719 -0.0693 -0.2632 -0.2406 -0.1677 0.3378 0.0251 0.2963 0.1167 -0.0168 -0.2008 -0.2131 -0.2722 -0.1181 -0.1179 -0.1579 -0.1471 0.0814 0.1577 -0.1444 0.1924 0.2657 -0.2193 -0.1671 -0.0771 -0.0940 -0.1701 0.0873 0.0858 0.0747 0.0982 0.1002 0.0945 0.0946 0.0887 0.1034 0.1364 0.1287 0.1303 0.1554 0.1248 0.1217 0.1263 0.1287 0.1274 0.1174 0.1260 0.1290 0.1243
va: 1.2448 1.2379 1.1224 2.0836 2.1555 2.1302 3.1120 3.8136 3.7414 3.8180 3.9194 3.9125 3.8135 4.2585 3.9136 3.8355 3.5290 3.7849 3.9990 4.0397 4.0273 4.0410 4.0070 3.8854 3.9632 3.9557 3.7914 3.9295 4.1169 3.8299 4.0386 3.8749 3.9329 3.8927 4.0287 1.0470 1.0300 1.0102 1.0017 1.0037 1.0157 1.0029 1.0018 1.0175 1.0239 1.0218 1.0092 1.0115 1.0123 1.0137 1.0199 1.0069 1.0134 1.0259 0.9979 0.9989 1.0022
dispcorr: -0.035451262 hartree
energy: -2381.017617952228
dipole: -7.12447 8.30320 1.17873 25.57734 -24.87077 0.70657 -14.22035 13.89159 -0.32877
magnitude: 1.41306 au
magnitude: 3.59171 debye
