program: Orca
programVersion: 5.0.2
elementType: Cl Cl F O O O N C C C C C C C C C C C C C C C C C C C C C C C C C C C C H H H H H H H H H H H H H H H H H H H H H H
charge: 0
multiplicity: 1
keywords: wb97x-d3
keywords: def2-TZVPP
keywords: def2/J RIJCOSX
keywords: DEFGRID2
keywords: scfconv7
keywords: smallprint printgap noloewdin
keywords: NOSOSCF
formula: C28H22Cl2FNO3
InChI: InChI=1/C28H22Cl2FNO3/c1-28(2)21(15-22(30)17-8-11-19(29)12-9-17)26(28)27(33)35-25(16-32)18-10-13-23(31)24(14-18)34-20-6-4-3-5-7-20/h3-15,21,25-26H,1-2H3
57 atoms
Cl 2.239262 1.346191 2.47543
Cl 7.372556 -0.570777 -1.789515
F  -3.769588 -4.404909 0.222783
O  -3.220946 1.676483 -1.263497
O  -3.008627 1.453969 0.952613
O  -1.786559 -3.114957 -1.104256
N  -6.300143 2.246013 0.110946
C  -0.615249 3.462223 0.556778
C  -0.088685 2.05953 0.605585
C  -1.221192 2.399214 -0.339906
C  0.197687 4.523009 -0.1456
C  -1.371464 3.983877 1.752777
C  1.215547 1.678433 0.039982
C  -2.548405 1.805739 -0.094895
C  2.288366 1.30772 0.737127
C  -4.449141 0.976689 -1.229926
C  3.547316 0.838143 0.144418
C  -4.293239 -0.473788 -0.816907
C  3.520662 0.076857 -1.024377
C  4.785199 1.134181 0.712426
C  -5.458687 1.689096 -0.437345
C  4.690755 -0.351356 -1.626214
C  5.961838 0.70873 0.12093
C  -3.131146 -1.144791 -1.170214
C  -5.291493 -1.154127 -0.134102
C  5.909708 -0.029886 -1.050996
C  -2.94258 -2.467019 -0.806746
C  -5.128679 -2.490712 0.19527
C  -3.952002 -3.135238 -0.128101
C  -0.658995 -2.768301 -0.408697
C  -0.680021 -1.994341 0.744664
C  0.544092 -3.246168 -0.913517
C  0.515807 -1.704893 1.387558
C  1.726825 -2.949346 -0.256551
C  1.722073 -2.173864 0.89506
H  -0.38958 1.500772 1.486217
H  -0.960795 2.486635 -1.389333
H  -0.442569 5.348474 -0.459925
H  0.712022 4.14759 -1.029629
H  0.956509 4.925024 0.527364
H  -0.671251 4.450894 2.447023
H  -1.90669 3.207209 2.292436
H  -2.095077 4.743431 1.451532
H  1.323957 1.690706 -1.038904
H  -4.796253 1.015203 -2.267147
H  2.571798 -0.219393 -1.45104
H  4.837985 1.710129 1.626564
H  -2.334102 -0.647424 -1.709201
H  4.653351 -0.947433 -2.527577
H  6.915148 0.9519 0.56905
H  -6.20079 -0.648583 0.162902
H  -5.901284 -3.025233 0.731365
H  -1.607039 -1.612584 1.151867
H  0.542924 -3.852811 -1.809698
H  0.496972 -1.101164 2.28496
H  2.66237 -3.323585 -0.651764
H  2.648511 -1.934694 1.398961
totalener: -2380.98096468 hartree
nucrepener: 3972.75085461 hartree
electener: -6353.73181929 hartree
twoeener: 4810.74982762 hartree
kineticenergy: 2373.55938566 hartree
xcener: -182.596766776229 hartree
chargesum: -0.0000000
charge: -0.089041 -0.070497 -0.183045 -0.285429 -0.351051 -0.300072 0.003340 0.112668 -0.022923 -0.084688 -0.228784 -0.255515 -0.084861 0.307776 0.000011 0.431154 0.105589 -0.049661 -0.236439 -0.159760 -0.280361 -0.128995 -0.135689 -0.209186 -0.117028 0.097087 0.140895 -0.161318 0.235640 0.278529 -0.145469 -0.198361 -0.165612 -0.134751 -0.117956 0.099677 0.078280 0.096896 0.074415 0.096669 0.089510 0.103385 0.091827 0.107105 0.123209 0.133162 0.118552 0.128872 0.121671 0.122300 0.123430 0.128800 0.133817 0.125071 0.128157 0.126110 0.132887
qa: -0.0890 -0.0705 -0.1830 -0.2854 -0.3511 -0.3001 0.0033 0.1127 -0.0229 -0.0847 -0.2288 -0.2555 -0.0849 0.3078 0.0000 0.4312 0.1056 -0.0497 -0.2364 -0.1598 -0.2804 -0.1290 -0.1357 -0.2092 -0.1170 0.0971 0.1409 -0.1613 0.2356 0.2785 -0.1455 -0.1984 -0.1656 -0.1348 -0.1180 0.0997 0.0783 0.0969 0.0744 0.0967 0.0895 0.1034 0.0918 0.1071 0.1232 0.1332 0.1186 0.1289 0.1217 0.1223 0.1234 0.1288 0.1338 0.1251 0.1282 0.1261 0.1329
va: 1.2474 1.2370 1.1216 2.1075 2.1381 2.1227 3.1074 3.8265 3.7902 3.9043 3.9046 3.9131 3.6805 4.2039 3.9646 3.9114 3.4705 3.7839 4.0123 4.0293 4.0500 4.0131 4.0270 4.0073 3.9447 3.9412 3.7916 3.9448 4.1105 3.7692 3.8564 4.0077 3.9355 3.9323 3.8760 1.0332 1.0405 1.0048 1.0072 1.0054 1.0021 1.0213 1.0024 1.0096 0.9848 1.0022 1.0283 1.0204 1.0141 1.0139 1.0224 1.0074 1.0160 1.0134 1.0131 1.0001 0.9995
dispcorr: -0.036998121 hartree
energy: -2381.017962796281
dipole: -8.31264 9.11240 0.79976 20.71000 -20.22530 0.48470 1.30905 -2.26512 -0.95607
magnitude: 1.33740 au
magnitude: 3.39939 debye
