program: Orca
programVersion: 5.0.2
elementType: F F O O O O N C C C C C C C C C C C C C C C C C C C C C C C C C C H H H H H H H H H H H H H H H H H H H H H H H
charge: 0
multiplicity: 1
keywords: wb97x-d3
keywords: def2-TZVPP
keywords: def2/J RIJCOSX
keywords: DEFGRID2
keywords: scfconv7
keywords: smallprint printgap noloewdin
keywords: NOSOSCF
formula: C26H23F2NO4
InChI: InChI=1/C26H23F2NO4/c1-17(2)24(18-11-13-21(14-12-18)32-26(27)28)25(30)33-23(16-29)19-7-6-10-22(15-19)31-20-8-4-3-5-9-20/h3-15,17,23-24,26H,1-2H3
56 atoms
F  -3.147622 -1.281023 -2.235705
F  -4.473601 -2.687505 -1.264556
O  3.245102 0.423497 0.749267
O  3.737745 -0.390235 -1.276405
O  -2.599424 -2.240575 -0.300083
O  -1.425079 2.563477 1.298615
N  4.030699 3.334191 2.138182
C  3.016011 -1.902327 0.46666
C  3.822248 -3.074954 -0.110607
C  1.52038 -2.004405 0.23319
C  5.300592 -2.929295 0.234718
C  3.288572 -4.398355 0.423623
C  3.405725 -0.574452 -0.13448
C  1.001185 -2.089926 -1.053441
C  0.630899 -1.991013 1.302451
C  3.220959 1.750063 0.226139
C  -0.365049 -2.165225 -1.280785
C  -0.735873 -2.077829 1.096868
C  -1.231992 -2.16841 -0.196247
C  1.824925 2.106498 -0.219504
C  0.79833 2.140141 0.717258
C  1.564523 2.350544 -1.55971
C  -0.487381 2.459325 0.310711
C  3.676183 2.61912 1.310275
C  0.268799 2.656319 -1.953855
C  -0.759961 2.722739 -1.028296
C  -3.182253 -2.42962 -1.516229
C  -2.747348 2.28234 1.053713
C  -3.686145 3.117612 1.641124
C  -3.140417 1.174851 0.314331
C  -5.036652 2.837839 1.486854
C  -4.494435 0.912794 0.16115
C  -5.446048 1.739739 0.743268
H  3.188349 -1.861656 1.546055
H  3.713415 -3.074989 -1.199271
H  5.448972 -2.940191 1.316783
H  5.736395 -2.007027 -0.151817
H  5.874501 -3.756914 -0.184135
H  3.884144 -5.228454 0.041568
H  3.336684 -4.431927 1.514489
H  2.254234 -4.577122 0.12943
H  1.660238 -2.093214 -1.912301
H  1.007828 -1.919649 2.315066
H  3.929628 1.868818 -0.598367
H  -0.712528 -2.212427 -2.303312
H  -1.416729 -2.074155 1.938348
H  0.991859 1.94178 1.765573
H  2.363903 2.310557 -2.288005
H  0.056311 2.855854 -2.995436
H  -1.758386 2.985258 -1.352808
H  -2.749284 -3.237598 -2.110811
H  -3.362064 3.973682 2.21911
H  -2.401442 0.525858 -0.136059
H  -5.769491 3.487212 1.947362
H  -4.809238 0.051136 -0.411292
H  -6.499307 1.526337 0.620019
elementType: F O N C H
totalener: -1560.10734876 hartree
nucrepener: 3417.84330589 hartree
electener: -4977.95065465 hartree
oneelecener: -8927.04575852 hartree
twoeener: 3949.09510387 hartree
cpcmener: -0.04258284 hartree
kineticenergy: 1553.61354360 hartree
xcener: -146.812454631254 hartree
chargesum: 0.0000000
charge: -0.220202 -0.207184 -0.281246 -0.447855 -0.302989 -0.334044 -0.100019 0.155704 0.058229 -0.063746 -0.293556 -0.315864 0.338816 -0.216010 -0.146526 0.425014 -0.168875 -0.217220 0.273320 0.039818 -0.291664 -0.192568 0.291917 -0.224745 -0.132720 -0.191905 0.412710 0.292300 -0.248037 -0.182166 -0.127000 -0.145692 -0.196309 0.096474 0.047636 0.089999 0.094576 0.094381 0.099212 0.090979 0.097775 0.143782 0.141127 0.137258 0.139280 0.145376 0.136615 0.149132 0.163525 0.157972 0.165684 0.147880 0.154229 0.161442 0.145714 0.160264
qa: -0.2202 -0.2072 -0.2812 -0.4479 -0.3030 -0.3340 -0.1000 0.1557 0.0582 -0.0637 -0.2936 -0.3159 0.3388 -0.2160 -0.1465 0.4250 -0.1689 -0.2172 0.2733 0.0398 -0.2917 -0.1926 0.2919 -0.2247 -0.1327 -0.1919 0.4127 0.2923 -0.2480 -0.1822 -0.1270 -0.1457 -0.1963 0.0965 0.0476 0.0900 0.0946 0.0944 0.0992 0.0910 0.0978 0.1438 0.1411 0.1373 0.1393 0.1454 0.1366 0.1491 0.1635 0.1580 0.1657 0.1479 0.1542 0.1614 0.1457 0.1603
va: 1.0550 1.0801 2.1522 2.0427 2.0755 2.0741 3.1093 3.6621 3.8051 3.5290 3.9247 3.9498 4.2432 4.0086 3.9398 3.7104 3.9478 3.9664 3.7393 3.6026 4.0426 3.9434 3.7417 4.0909 3.9016 3.9106 4.1851 3.7176 3.9961 3.8950 3.8826 3.8912 3.9495 1.0393 1.0267 1.0021 1.0117 1.0042 1.0042 1.0021 0.9996 1.0196 1.0026 1.0200 1.0156 1.0072 1.0271 1.0058 0.9891 0.9945 0.9689 1.0074 0.9914 0.9874 1.0248 0.9908
dispcorr: -0.033719080 hartree
energy: -1560.141067839818
dipole: 20.34516 -20.80964 -0.46448 -12.89718 10.93730 -1.95988 2.86895 -4.23908 -1.37013
magnitude: 2.43601 au
magnitude: 6.19184 debye
