program: Gaussian 09
title: 000074714
version: EM64L-G09RevD.01
frameworkgroup: C1[X(C9H3Cl3N2O)]
method: RPBEPBE
basis: SDD
operation: Freq
keyword: #p
keyword: freq=noraman
keyword: PBEPBE/SDD
title: #p freq=noraman PBEPBE/SDD
converged: NO YES NO NO
title: Mulliken charges:
elementType: Cl Cl Cl O N N C C C C C C C C C H H H
charge: 0.040212 0.043697 -0.077257 -0.094782 0.122694 0.126554 0.102372 0.077639 -0.463019 0.442178 -0.305483 -0.284666 -0.207468 -0.202361 -0.180570 0.308008 0.277519 0.274732
chargesum: 0.00000
title: Mulliken charges with hydrogens summed into heavy atoms:
elementType: Cl Cl Cl O N N C C C C C C C C C
charge: 0.040212 0.043697 -0.077257 -0.094782 0.122694 0.126554 0.102372 0.077639 -0.155010 0.442178 -0.027963 -0.009934 -0.207468 -0.202361 -0.180570
polarizability: 2.95811774e+02 -9.18415339e+00 1.40945115e+02 -1.25379513e-02 3.35193488e-03 4.96947050e+01
1716.lowfreq: -11.8848 -8.2232 -1.7554 -0.0027 -0.0024 -0.0023 27.9341 46.6805 84.9290
frequency: 27.9144 46.6521 84.9141 115.1195 158.3003 181.9278 211.7782 240.7982 269.5704 322.4787 346.1430 376.5099 398.4914 435.0446 468.0576 496.5119 528.8686 537.4841 586.4720 605.0634 638.7383 654.2456 699.2736 763.9758 776.8727 807.7048 860.9457 939.2758 943.4240 967.7018 996.3211 1121.0590 1126.9112 1182.7950 1212.4044 1273.6167 1297.4116 1334.8062 1397.3430 1421.6485 1476.4304 1513.4328 1538.6975 1611.6727 1707.2833 3171.4125 3176.1267 3190.1716
redmass: 18.9983 12.1261 7.8119 16.6332 9.2335 32.5418 19.8610 13.2021 7.1352 7.5312 15.2821 12.5885 14.3048 5.3427 12.3158 4.6301 6.2541 6.4728 9.5332 12.4345 9.5922 8.3862 5.0883 7.7307 4.5826 7.5778 1.5361 9.8207 1.4836 3.6607 1.3382 3.0839 2.0554 4.4964 2.0637 1.5741 5.5290 10.5630 4.6424 5.1648 4.2598 12.5441 7.2604 7.0888 12.9124 1.0891 1.0932 1.0973
irintensity: 0.0480 1.0867 0.0173 2.2353 2.3928 0.1606 0.0447 1.8593 0.0030 0.4611 2.7797 48.2294 13.8243 7.2581 19.3677 0.5467 0.0752 8.0154 66.0608 9.4556 8.4741 7.6849 14.2447 45.6921 0.0050 152.4359 36.0825 96.6670 21.3066 81.7555 0.0230 411.0572 78.1127 39.6919 32.0618 33.8859 131.2038 22.6461 50.9060 8.3644 6.2323 38.9350 40.0318 45.7266 247.0873 1.5134 2.1314 1.3067
temp: 298.150 k
press: 1.00000 atm
elementType: 17 17 17 8 7 7 6 6 6 6 6 6 6 6 6 1 1 1
symmnumber: 1
zpe: 264612.8 jmol-1
zpe.correction: 0.100786 hartree
zpe.thermalcorrener: 0.113430 hartree
zpe.thermalcorrenthalpy: 0.114374 hartree
zpe.thermalcorrgfe: 0.059331 hartree
zpe.sumelectzpe: -1908.631203 hartree
zpe.sumelectthermal: -1908.618559 hartree
zpe.sumelectthermalent: -1908.617615 hartree
zpe.sumelectthermalfe: -1908.672658 hartree
dipole: -0.7184 -2.0792 0.0033
dipole: 2.1998
quadrupole: -124.5363 -109.0756 -104.8539
quadrupole: -7.9287 0.0127 0.0034
quadrupole: -11.7144 3.7463 7.9681 -7.9287 0.0127 0.0034
hfenergy: -1908.7319888 hartree
pointgroup: C01 [X(C9H3Cl3N2O1)]
dipole: 0.3253646 0.8019992 0.0012838 debye
dipolederiv: -0.6814235 0.399113 0.000019 0.6021357 -0.4353312 -0.0000176 -0.0000032 0.0000119 -0.0357762 -1.0350054 -0.2257438 0.0000682 -0.4030587 -0.1484037 0.0000279 0.0000602 0.0000155 -0.0348312 -0.9293208 0.3636445 -0.0003672 0.5640697 -0.5258738 0.000344 -0.0012034 0.0006752 -0.1272755 -0.7852054 -0.1514077 -0.0000022 -0.1991836 -1.0552747 0.000499 -0.000246 -0.0011905 -0.2221382 -0.5148305 0.3562844 -0.0000335 -0.3399512 -0.2580645 0.0000219 -0.0000332 -0.0000538 -0.1622909 -0.6753378 -0.1396895 0.0000292 0.4587444 -0.3050489 -0.0000166 0.0000819 0.0000241 -0.1639286 0.087602 -0.3165982 0.0000155 0.2256864 -0.0888209 -0.0000018 -0.0000063 0.0000604 0.0861461 0.3338553 0.0664208 -0.000033 -0.3704936 0.0873556 0.0000382 -0.000003 -0.0000147 0.0908705 0.2835517 0.1825093 -0.0000648 -0.1881022 0.0439499 -0.0000857 0.0003158 0.0000113 -0.0817798 -1.0488919 -0.0685415 -0.0001902 0.1634225 -0.0802805 0.0000353 0.0001377 0.0000396 0.0153799 -0.2739411 0.0790865 0.000009 0.0426754 0.1685901 -0.0000092 0.0000099 -0.000075 -0.1223168 0.0331733 -0.0988949 -0.0000793 0.1014668 -0.0048195 0.0000119 0.000348 0.0000503 -0.1013404 0.8711324 -0.8589949 0.000014 -1.1365367 0.6889568 0.0000301 0.0000137 0.0000243 0.0873192 1.5780825 0.5379899 -0.000118 0.7545149 0.2504591 -0.000051 -0.0001371 -0.0000418 0.0954916 2.4704224 -0.1401825 0.0006858 -0.2932113 1.5179222 -0.0008258 0.0006925 0.000422 0.1902356 0.1237467 -0.0233139 0.0000213 -0.0177136 0.061805 0.0000059 0.000026 -0.000012 0.1635972 0.0792883 -0.0340619 -0.0000111 -0.0004967 -0.0042663 -0.0000003 -0.0000786 0.0000256 0.162806 0.0831017 0.0723804 0.0000371 0.0360317 0.0871453 -0.000006 0.0000251 0.0000277 0.1598315 unknown
polarizability: 294.4151104|-17.2827843|142.3417791|0.0123439|-0.004008|49.694705 unknown
InChI: InChI=1S/C9H3Cl3N2O/c10-7-8(11)14-6-3-4(9(12)15)1-2-5(6)13-7/h1-3H
charge 0 multiplicity 1
18 atoms
Cl 3.931837 -2.081201 -0.000218
Cl 4.531664 1.149799 -0.000407
Cl -4.886467 0.73201 -0.001518
O  -3.808228 -1.76277 -0.001235
N  1.334612 -1.365868 -0.00004
N  1.852792 1.420046 -0.000162
C  0.277827 -0.462756 0.000085
C  0.542536 0.96057 0.000029
C  -1.060442 -0.933109 0.000245
C  -2.121564 -0.005646 0.000405
C  -0.544969 1.880431 0.000159
C  -1.856709 1.403842 0.000349
C  2.567329 -0.894991 -0.000215
C  2.832629 0.53391 -0.000284
C  -3.498126 -0.572907 0.000637
H  -1.251337 -2.010107 0.000277
H  -0.322514 2.9508 0.000113
H  -2.698268 2.100846 0.000479
