program: Orca
programVersion: 5.0.2
elementType: F F O O O O N C C C C C C C C C C C C C C C C C C C C C C C C C C H H H H H H H H H H H H H H H H H H H H H H H
charge: 0
multiplicity: 1
keywords: wb97x-d3
keywords: def2-TZVPP
keywords: def2/J RIJCOSX
keywords: DEFGRID2
keywords: scfconv7
keywords: smallprint printgap noloewdin
keywords: NOSOSCF
formula: C26H23F2NO4
InChI: InChI=1/C26H23F2NO4/c1-17(2)24(18-11-13-21(14-12-18)32-26(27)28)25(30)33-23(16-29)19-7-6-10-22(15-19)31-20-8-4-3-5-9-20/h3-15,17,23-24,26H,1-2H3
56 atoms
F  -2.350163 -2.986365 3.847019
F  -3.945965 -1.73339 3.108093
O  3.004009 0.548476 -0.004822
O  1.981482 0.440262 -1.99364
O  -2.424385 -2.369506 1.708717
O  -2.277788 2.463763 -0.106715
N  4.422635 3.019618 1.665278
C  2.578414 -1.606182 -0.857603
C  2.843018 -2.369973 -2.160067
C  1.260187 -1.91174 -0.169388
C  4.210221 -1.992242 -2.720543
C  2.770588 -3.872085 -1.916758
C  2.504729 -0.111176 -1.060681
C  1.205128 -2.019881 1.213338
C  0.066667 -1.983054 -0.886389
C  2.592281 1.908727 0.170472
C  -0.000459 -2.188711 1.882476
C  -1.143739 -2.141169 -0.237245
C  -1.17561 -2.226281 1.148162
C  1.228538 1.921838 0.813899
C  0.126277 2.262639 0.043341
C  1.070386 1.474594 2.121521
C  -1.14729 2.12288 0.581782
C  3.617786 2.517007 1.01581
C  -0.204619 1.364094 2.651083
C  -1.317879 1.668732 1.881753
C  -2.629125 -1.970802 2.994399
C  -2.362168 2.260729 -1.462718
C  -3.063898 3.209144 -2.1923
C  -1.833254 1.135217 -2.081697
C  -3.237653 3.027605 -3.556877
C  -2.004507 0.97406 -3.449013
C  -2.704315 1.914951 -4.192621
H  3.387649 -1.828424 -0.15658
H  2.081521 -2.100338 -2.897396
H  4.292548 -0.927641 -2.944817
H  4.408261 -2.532507 -3.647085
H  5.003913 -2.246237 -2.014557
H  3.494252 -4.182417 -1.159653
H  1.782837 -4.191693 -1.584024
H  2.997905 -4.417364 -2.833662
H  2.118752 -1.969891 1.792339
H  0.067186 -1.901874 -1.966128
H  2.587016 2.452927 -0.77806
H  0.010539 -2.286768 2.959558
H  -2.065824 -2.180368 -0.802796
H  0.267363 2.62482 -0.967123
H  1.929599 1.203447 2.72263
H  -0.338398 1.016266 3.666626
H  -2.314863 1.562705 2.290383
H  -2.059999 -1.086564 3.291042
H  -3.473958 4.078513 -1.694459
H  -1.298845 0.385241 -1.512667
H  -3.787644 3.766767 -4.124196
H  -1.591137 0.097983 -3.931379
H  -2.835372 1.780345 -5.257802
elementType: F O N C H
totalener: -1560.10548131 hartree
nucrepener: 3470.88845347 hartree
electener: -5030.99393478 hartree
oneelecener: -9032.06732760 hartree
twoeener: 4001.07339282 hartree
cpcmener: -0.04460372 hartree
kineticenergy: 1553.61945825 hartree
xcener: -146.816138072156 hartree
chargesum: 0.0000000
charge: -0.211938 -0.204971 -0.274239 -0.449224 -0.287621 -0.336663 -0.099215 0.151663 0.058231 0.035697 -0.298770 -0.306634 0.318237 -0.229813 -0.213698 0.409582 -0.171211 -0.210779 0.250975 0.021557 -0.189480 -0.226445 0.308165 -0.221595 -0.131509 -0.245823 0.422627 0.249896 -0.211432 -0.129892 -0.151306 -0.210767 -0.152737 0.098774 0.044685 0.096008 0.094323 0.091293 0.091398 0.099119 0.096676 0.144774 0.160227 0.137747 0.149117 0.147478 0.146745 0.146660 0.167061 0.148950 0.104404 0.148177 0.144644 0.160697 0.158967 0.161211
qa: -0.2119 -0.2050 -0.2742 -0.4492 -0.2876 -0.3367 -0.0992 0.1517 0.0582 0.0357 -0.2988 -0.3066 0.3182 -0.2298 -0.2137 0.4096 -0.1712 -0.2108 0.2510 0.0216 -0.1895 -0.2264 0.3082 -0.2216 -0.1315 -0.2458 0.4226 0.2499 -0.2114 -0.1299 -0.1513 -0.2108 -0.1527 0.0988 0.0447 0.0960 0.0943 0.0913 0.0914 0.0991 0.0967 0.1448 0.1602 0.1377 0.1491 0.1475 0.1467 0.1467 0.1671 0.1489 0.1044 0.1482 0.1446 0.1607 0.1590 0.1612
va: 1.0534 1.0716 2.1513 2.0375 2.0454 2.0838 3.1094 3.6542 3.8036 3.5069 3.9305 3.9428 4.2539 4.0055 3.9388 3.7467 3.8120 3.9588 3.7713 3.5907 3.9062 3.9224 3.6961 4.0759 3.8587 3.9579 4.2451 3.7290 3.9637 3.8126 3.9034 3.9511 3.8751 1.0358 1.0302 1.0105 1.0038 1.0026 1.0017 1.0015 1.0047 1.0075 0.9962 1.0192 1.0106 1.0075 1.0107 1.0080 0.9848 1.0064 0.9851 1.0072 0.9841 0.9885 0.9943 0.9891
dispcorr: -0.036292505 hartree
energy: -1560.141773814274
dipole: 19.58909 -19.44415 0.14493 -7.56849 6.80706 -0.76143 -26.75341 26.00446 -0.74895
magnitude: 1.07782 au
magnitude: 2.73961 debye
