program: Orca
programVersion: 5.0.2
elementType: F F O O O O N C C C C C C C C C C C C C C C C C C C C C C C C C C H H H H H H H H H H H H H H H H H H H H H H H
charge: 0
multiplicity: 1
keywords: wb97x-d3
keywords: def2-TZVPP
keywords: def2/J RIJCOSX
keywords: DEFGRID2
keywords: scfconv7
keywords: smallprint printgap noloewdin
keywords: NOSOSCF
formula: C26H23F2NO4
InChI: InChI=1/C26H23F2NO4/c1-17(2)24(18-11-13-21(14-12-18)32-26(27)28)25(30)33-23(16-29)19-7-6-10-22(15-19)31-20-8-4-3-5-9-20/h3-15,17,23-24,26H,1-2H3
56 atoms
F  -4.241674 -2.875498 -0.924917
F  -3.639849 -2.50562 1.114293
O  3.295589 0.428298 0.860215
O  4.027876 -0.0241 -1.204658
O  -2.393385 -1.795865 -0.595757
O  -1.745826 1.282065 0.630735
N  3.173461 3.149118 2.737616
C  3.227899 -1.826257 0.198601
C  3.999308 -2.872745 -0.615407
C  1.724298 -1.86001 -0.007737
C  5.485756 -2.826794 -0.277588
C  3.445659 -4.266366 -0.343527
C  3.605523 -0.407483 -0.146051
C  1.170768 -1.643436 -1.268469
C  0.869889 -2.057516 1.068725
C  3.074332 1.79424 0.50676
C  -0.201582 -1.640664 -1.450047
C  -0.508805 -2.05173 0.904519
C  -1.03398 -1.847665 -0.361252
C  1.731235 1.926243 -0.168373
C  0.576028 1.614144 0.54239
C  1.660404 2.269257 -1.510093
C  -0.649016 1.644578 -0.101433
C  3.129349 2.537647 1.764563
C  0.424371 2.288952 -2.143387
C  -0.73175 1.970271 -1.45187
C  -3.167321 -2.809452 -0.121848
C  -2.93055 1.957095 0.4762
C  -2.982178 3.329487 0.263138
C  -4.096641 1.21551 0.603624
C  -4.218222 3.951753 0.159364
C  -5.324567 1.854367 0.509995
C  -5.392871 3.221315 0.278272
H  3.427273 -1.993012 1.261706
H  3.871899 -2.654694 -1.679993
H  6.034635 -3.56249 -0.866759
H  5.650011 -3.060217 0.776741
H  5.935132 -1.853347 -0.476412
H  2.40276 -4.364852 -0.645357
H  4.016585 -5.014953 -0.894152
H  3.511209 -4.516656 0.717942
H  1.808337 -1.479126 -2.128097
H  1.28012 -2.213631 2.058451
H  3.872052 2.181083 -0.13413
H  -0.624305 -1.474268 -2.432279
H  -1.147612 -2.19085 1.766292
H  0.62056 1.345919 1.591865
H  2.55962 2.514672 -2.059681
H  0.361796 2.543628 -3.192625
H  -1.685574 1.974582 -1.963478
H  -2.661965 -3.7767 -0.077446
H  -2.075781 3.915676 0.18119
H  -4.045219 0.150447 0.785688
H  -4.257642 5.019756 -0.010207
H  -6.231962 1.273615 0.610907
H  -6.352048 3.714412 0.1957
elementType: F O N C H
totalener: -1560.10582343 hartree
nucrepener: 3456.22095160 hartree
electener: -5016.32677503 hartree
oneelecener: -9004.39984190 hartree
twoeener: 3988.07306687 hartree
cpcmener: -0.04261281 hartree
kineticenergy: 1553.62769215 hartree
xcener: -146.815680928257 hartree
chargesum: 0.0000000
charge: -0.206079 -0.217843 -0.283645 -0.437090 -0.319505 -0.337747 -0.099510 0.127716 0.065250 -0.015046 -0.294119 -0.313395 0.336511 -0.200106 -0.179987 0.433244 -0.220692 -0.121651 0.230695 0.055470 -0.308652 -0.179910 0.287099 -0.235296 -0.111605 -0.197814 0.408481 0.291785 -0.193297 -0.244005 -0.157761 -0.149516 -0.178433 0.100875 0.044994 0.094059 0.089104 0.094357 0.097304 0.098884 0.090999 0.142908 0.141922 0.141715 0.150476 0.149304 0.134130 0.148223 0.163460 0.157670 0.145461 0.156053 0.143117 0.162084 0.158525 0.160828
qa: -0.2061 -0.2178 -0.2836 -0.4371 -0.3195 -0.3377 -0.0995 0.1277 0.0652 -0.0150 -0.2941 -0.3134 0.3365 -0.2001 -0.1800 0.4332 -0.2207 -0.1217 0.2307 0.0555 -0.3087 -0.1799 0.2871 -0.2353 -0.1116 -0.1978 0.4085 0.2918 -0.1933 -0.2440 -0.1578 -0.1495 -0.1784 0.1009 0.0450 0.0941 0.0891 0.0944 0.0973 0.0989 0.0910 0.1429 0.1419 0.1417 0.1505 0.1493 0.1341 0.1482 0.1635 0.1577 0.1455 0.1561 0.1431 0.1621 0.1585 0.1608
va: 1.0721 1.0499 2.1480 2.0543 1.9956 2.0126 3.1099 3.6710 3.8089 3.4810 3.9267 3.9507 4.2632 3.9229 3.9640 3.7147 4.0040 3.9096 3.6710 3.5532 4.0859 3.9397 3.6274 4.0893 3.8845 3.9277 4.2134 3.6850 3.9050 3.9632 3.8912 3.9267 3.8931 1.0366 1.0271 1.0043 1.0020 1.0128 1.0001 1.0044 1.0017 1.0164 1.0043 1.0142 1.0038 1.0149 1.0278 1.0072 0.9883 0.9982 0.9759 0.9982 1.0315 0.9895 0.9910 0.9891
dispcorr: -0.035933475 hartree
energy: -1560.141756902847
dipole: 22.77389 -22.46490 0.30899 -7.33876 5.95337 -1.38539 -6.28272 4.89288 -1.38984
magnitude: 1.98656 au
magnitude: 5.04944 debye
