program: Orca
programVersion: 5.0.2
elementType: F F O O O O N C C C C C C C C C C C C C C C C C C C C C C C C C C H H H H H H H H H H H H H H H H H H H H H H H
charge: 0
multiplicity: 1
keywords: wb97x-d3
keywords: def2-TZVPP
keywords: def2/J RIJCOSX
keywords: DEFGRID2
keywords: scfconv7
keywords: smallprint printgap noloewdin
keywords: NOSOSCF
formula: C26H23F2NO4
InChI: InChI=1/C26H23F2NO4/c1-17(2)24(18-11-13-21(14-12-18)32-26(27)28)25(30)33-23(16-29)19-7-6-10-22(15-19)31-20-8-4-3-5-9-20/h3-15,17,23-24,26H,1-2H3
56 atoms
F  -3.507291 -3.155277 0.360809
F  -4.719713 -1.902369 -0.925235
O  3.091739 0.510438 0.408348
O  4.126885 -0.569954 -1.261982
O  -2.576907 -1.730815 -1.075212
O  -1.534056 1.666533 -1.073969
N  5.187486 3.039355 0.916265
C  2.900266 -1.824833 0.414798
C  3.629951 -3.120992 0.035567
C  1.429203 -1.81277 0.046028
C  5.068346 -3.104159 0.54293
C  2.894415 -4.326316 0.609775
C  3.478909 -0.598479 -0.250518
C  0.455874 -1.605232 1.012369
C  1.023897 -1.968854 -1.277825
C  3.214922 1.771781 -0.237745
C  -0.895034 -1.571191 0.689792
C  -0.316367 -1.937613 -1.618794
C  -1.275424 -1.74351 -0.633134
C  1.881616 2.479685 -0.153331
C  0.766082 1.781737 -0.60908
C  1.741826 3.769886 0.332735
C  -0.478835 2.381197 -0.572137
C  4.310022 2.495642 0.409361
C  0.484547 4.363402 0.349745
C  -0.631445 3.680211 -0.098946
C  -3.598545 -1.920909 -0.189969
C  -2.702036 1.596173 -0.358339
C  -3.877908 1.497772 -1.089018
C  -2.723307 1.565489 1.030697
C  -5.087012 1.375696 -0.420762
C  -3.942848 1.454921 1.684906
C  -5.1275 1.361738 0.967012
H  2.976589 -1.689849 1.49889
H  3.640896 -3.213928 -1.054654
H  5.093933 -3.029895 1.63237
H  5.651962 -2.276484 0.139976
H  5.581561 -4.025617 0.26505
H  2.826233 -4.263462 1.698382
H  1.881854 -4.423315 0.217997
H  3.427719 -5.245871 0.365716
H  0.74694 -1.470466 2.046556
H  1.756674 -2.121119 -2.060957
H  3.493945 1.643367 -1.288399
H  -1.612601 -1.407327 1.482281
H  -0.621565 -2.066764 -2.649229
H  0.853992 0.776438 -1.003586
H  2.59553 4.326926 0.695967
H  0.376249 5.373828 0.719859
H  -1.604385 4.154523 -0.083924
H  -3.666646 -1.178489 0.606967
H  -3.843914 1.515337 -2.170877
H  -1.806641 1.62249 1.60352
H  -6.002918 1.300327 -0.991793
H  -3.960877 1.435163 2.766615
H  -6.073229 1.275469 1.48479
elementType: F O N C H
totalener: -1560.10605192 hartree
nucrepener: 3463.09552926 hartree
electener: -5023.20158118 hartree
oneelecener: -9016.72881468 hartree
twoeener: 3993.52723350 hartree
cpcmener: -0.04134807 hartree
kineticenergy: 1553.60865556 hartree
xcener: -146.816697733563 hartree
chargesum: 0.0000000
charge: -0.210152 -0.197707 -0.282106 -0.444200 -0.293390 -0.337672 -0.096682 0.125142 0.065251 -0.081372 -0.295561 -0.313874 0.369679 -0.191130 -0.130809 0.447691 -0.161440 -0.210509 0.266359 -0.079948 -0.225412 -0.142125 0.216320 -0.238897 -0.140915 -0.157765 0.399511 0.313134 -0.262141 -0.192761 -0.131194 -0.157650 -0.171068 0.102030 0.045686 0.088944 0.094065 0.094448 0.091035 0.097627 0.098723 0.140257 0.142352 0.146686 0.143895 0.146059 0.161133 0.137154 0.163460 0.159575 0.113074 0.144367 0.155181 0.158988 0.159113 0.159542
qa: -0.2102 -0.1977 -0.2821 -0.4442 -0.2934 -0.3377 -0.0967 0.1251 0.0653 -0.0814 -0.2956 -0.3139 0.3697 -0.1911 -0.1308 0.4477 -0.1614 -0.2105 0.2664 -0.0799 -0.2254 -0.1421 0.2163 -0.2389 -0.1409 -0.1578 0.3995 0.3131 -0.2621 -0.1928 -0.1312 -0.1577 -0.1711 0.1020 0.0457 0.0889 0.0941 0.0944 0.0910 0.0976 0.0987 0.1403 0.1424 0.1467 0.1439 0.1461 0.1611 0.1372 0.1635 0.1596 0.1131 0.1444 0.1552 0.1590 0.1591 0.1595
va: 1.0633 1.0724 2.1380 2.0526 2.0244 2.0179 3.1111 3.6729 3.8106 3.4974 3.9289 3.9499 4.1984 3.9895 3.9163 3.6955 3.8804 4.0301 3.6662 3.8930 3.9627 3.8736 3.8014 4.0811 3.9345 3.9223 4.2623 3.5013 3.9842 3.8330 3.8324 3.8906 3.8717 1.0346 1.0265 1.0019 1.0143 1.0040 1.0019 1.0001 1.0045 1.0062 1.0127 1.0206 0.9995 1.0073 0.9964 1.0147 0.9900 0.9944 0.9736 1.0104 1.0019 0.9883 0.9914 0.9898
dispcorr: -0.036417330 hartree
energy: -1560.142469249875
dipole: 18.27230 -19.86524 -1.59294 -7.65857 7.78975 0.13118 7.46633 -6.41147 1.05487
magnitude: 1.91505 au
magnitude: 4.86766 debye
