program: Orca
programVersion: 5.0.2
elementType: F F O O O O N C C C C C C C C C C C C C C C C C C C C C C C C C C H H H H H H H H H H H H H H H H H H H H H H H
charge: 0
multiplicity: 1
keywords: wb97x-d3
keywords: def2-TZVPP
keywords: def2/J RIJCOSX
keywords: DEFGRID2
keywords: scfconv7
keywords: smallprint printgap noloewdin
keywords: NOSOSCF
formula: C26H23F2NO4
InChI: InChI=1/C26H23F2NO4/c1-17(2)24(18-11-13-21(14-12-18)32-26(27)28)25(30)33-23(16-29)19-7-6-10-22(15-19)31-20-8-4-3-5-9-20/h3-15,17,23-24,26H,1-2H3
56 atoms
F  -3.975639 -1.355579 2.902957
F  -3.8642 -2.684729 1.203244
O  3.101534 0.609268 -0.164859
O  2.252806 0.198286 -2.201115
O  -2.024361 -2.064677 2.298636
O  -2.283515 1.415571 0.263296
N  4.445742 3.471061 0.84245
C  2.766514 -1.646255 -0.724351
C  2.974211 -2.623387 -1.885864
C  1.470564 -1.81956 0.050651
C  4.310636 -2.361222 -2.572746
C  2.921078 -4.058847 -1.377792
C  2.698572 -0.203027 -1.158954
C  0.24284 -1.898345 -0.5980
C  1.481198 -1.810621 1.442297
C  2.572472 1.937213 -0.13459
C  -0.946449 -1.990892 0.11262
C  0.30464 -1.88309 2.167681
C  -0.907975 -1.97284 1.499805
C  1.322494 1.92257 0.709472
C  0.105071 1.752995 0.059937
C  1.390681 1.940597 2.096231
C  -1.053166 1.616441 0.812982
C  3.623664 2.786943 0.420023
C  0.224496 1.796263 2.833584
C  -0.996648 1.632144 2.201878
C  -3.234874 -1.657148 1.823981
C  -2.521526 1.71439 -1.057597
C  -2.30768 2.993046 -1.555094
C  -3.049033 0.71383 -1.858591
C  -2.621404 3.262002 -2.879109
C  -3.371182 1.000882 -3.178446
C  -3.154149 2.270842 -3.694068
H  3.598119 -1.76145 -0.022686
H  2.174051 -2.486972 -2.619126
H  4.46167 -3.062625 -3.394171
H  5.139441 -2.489825 -1.872933
H  4.381543 -1.356508 -2.990717
H  1.955578 -4.306971 -0.936285
H  3.095871 -4.758333 -2.196181
H  3.689515 -4.236271 -0.621813
H  0.191525 -1.895847 -1.679549
H  2.422518 -1.739418 1.972714
H  2.358192 2.304627 -1.142087
H  -1.874982 -2.081481 -0.4353
H  0.326708 -1.866669 3.249648
H  0.074733 1.725193 -1.021613
H  2.338515 2.062023 2.605508
H  0.266227 1.809332 3.914256
H  -1.905356 1.514375 2.778829
H  -3.191598 -0.802754 1.147591
H  -1.903505 3.771623 -0.920202
H  -3.215163 -0.275996 -1.451456
H  -2.453843 4.256228 -3.27168
H  -3.789732 0.223859 -3.80431
H  -3.402738 2.489972 -4.723777
elementType: F O N C H
totalener: -1560.10552956 hartree
nucrepener: 3503.19372183 hartree
electener: -5063.29925139 hartree
oneelecener: -9096.74916186 hartree
twoeener: 4033.44991046 hartree
cpcmener: -0.04142429 hartree
kineticenergy: 1553.61319160 hartree
xcener: -146.815250472499 hartree
chargesum: 0.0000000
charge: -0.206677 -0.212924 -0.279150 -0.438671 -0.290840 -0.327429 -0.099595 0.132058 0.059944 0.004995 -0.297333 -0.309890 0.340011 -0.215390 -0.182969 0.402318 -0.187213 -0.233741 0.279836 0.003782 -0.197852 -0.215143 0.321409 -0.220908 -0.118792 -0.253811 0.429662 0.309512 -0.207326 -0.245414 -0.137621 -0.140831 -0.178642 0.100803 0.046500 0.094354 0.090950 0.094709 0.098462 0.097203 0.090784 0.142218 0.140561 0.137619 0.155047 0.147274 0.143548 0.138651 0.159945 0.144261 0.094224 0.158699 0.152275 0.162884 0.162243 0.161422
qa: -0.2067 -0.2129 -0.2792 -0.4387 -0.2908 -0.3274 -0.0996 0.1321 0.0599 0.0050 -0.2973 -0.3099 0.3400 -0.2154 -0.1830 0.4023 -0.1872 -0.2337 0.2798 0.0038 -0.1979 -0.2151 0.3214 -0.2209 -0.1188 -0.2538 0.4297 0.3095 -0.2073 -0.2454 -0.1376 -0.1408 -0.1786 0.1008 0.0465 0.0944 0.0910 0.0947 0.0985 0.0972 0.0908 0.1422 0.1406 0.1376 0.1550 0.1473 0.1435 0.1387 0.1599 0.1443 0.0942 0.1587 0.1523 0.1629 0.1622 0.1614
va: 1.0701 1.0540 2.1286 2.0531 2.0445 2.0488 3.1082 3.6474 3.8142 3.4896 3.9267 3.9462 4.2464 3.9709 3.9563 3.7411 3.8615 3.9568 3.7176 3.6871 3.8689 3.9501 3.5825 4.0741 3.8813 3.9621 4.2246 3.6531 3.9537 3.9664 3.8822 3.9060 3.9009 1.0354 1.0264 1.0037 1.0021 1.0125 1.0013 1.0041 1.0019 1.0170 1.0052 1.0230 1.0042 1.0069 1.0208 1.0097 0.9892 1.0101 1.0015 0.9967 1.0034 0.9884 0.9896 0.9891
dispcorr: -0.037103582 hartree
energy: -1560.142633140115
dipole: 21.30907 -21.76656 -0.45749 -8.50029 7.97483 -0.52545 -20.06546 19.12494 -0.94052
magnitude: 1.17046 au
magnitude: 2.97507 debye
