program: Orca
programVersion: 5.0.2
elementType: F F O O O O N C C C C C C C C C C C C C C C C C C C C C C C C C C H H H H H H H H H H H H H H H H H H H H H H H
charge: 0
multiplicity: 1
keywords: wb97x-d3
keywords: def2-TZVPP
keywords: def2/J RIJCOSX
keywords: DEFGRID2
keywords: scfconv7
keywords: smallprint printgap noloewdin
keywords: NOSOSCF
formula: C26H23F2NO4
InChI: InChI=1/C26H23F2NO4/c1-17(2)24(18-11-13-21(14-12-18)32-26(27)28)25(30)33-23(16-29)19-7-6-10-22(15-19)31-20-8-4-3-5-9-20/h3-15,17,23-24,26H,1-2H3
56 atoms
F  -3.992266 -1.312594 2.897755
F  -3.876501 -2.640205 1.196486
O  3.098507 0.604049 -0.166116
O  2.234646 0.214234 -2.199924
O  -2.039444 -2.022232 2.298355
O  -2.277123 1.458233 0.280293
N  4.480469 3.436166 0.862226
C  2.74527 -1.6446 -0.739713
C  2.937158 -2.616271 -1.908299
C  1.451736 -1.810317 0.040933
C  4.270029 -2.360522 -2.604036
C  2.876071 -4.054106 -1.407783
C  2.68423 -0.197665 -1.163449
C  0.222142 -1.889629 -0.603995
C  1.465862 -1.788768 1.432371
C  2.583667 1.937285 -0.124074
C  -0.965443 -1.971531 0.11028
C  0.290534 -1.848705 2.161197
C  -0.923808 -1.940033 1.497075
C  1.335189 1.931629 0.722347
C  0.116142 1.76779 0.073656
C  1.403412 1.956125 2.108763
C  -1.04355 1.644694 0.826664
C  3.647338 2.768733 0.434937
C  0.235603 1.824676 2.846472
C  -0.986593 1.666593 2.215826
C  -3.248034 -1.613402 1.820751
C  -2.502192 1.699975 -1.054422
C  -2.280525 2.955924 -1.603768
C  -3.025707 0.668092 -1.817198
C  -2.579289 3.169114 -2.941354
C  -3.333359 0.899355 -3.151339
C  -3.105824 2.144997 -3.718792
H  3.579987 -1.771227 -0.043755
H  2.13289 -2.469464 -2.634958
H  4.344055 -1.354846 -3.019089
H  4.410049 -3.059962 -3.429089
H  5.103317 -2.497044 -1.911142
H  1.911561 -4.296992 -0.961183
H  3.039807 -4.750587 -2.231008
H  3.647983 -4.241829 -0.657869
H  0.168128 -1.896556 -1.685363
H  2.408597 -1.716735 1.960139
H  2.371507 2.314938 -1.128296
H  -1.894875 -2.066773 -0.434927
H  0.315412 -1.822463 3.242899
H  0.085845 1.736718 -1.007695
H  2.351617 2.073056 2.618297
H  0.277329 1.842413 3.927093
H  -1.896005 1.558624 2.793597
H  -3.202285 -0.758713 1.144911
H  -1.882756 3.760104 -0.997343
H  -3.201234 -0.302615 -1.370468
H  -2.405852 4.145658 -3.373659
H  -3.746856 0.096923 -3.747771
H  -3.341891 2.319764 -4.759868
elementType: F O N C H
totalener: -1560.10541175 hartree
nucrepener: 3508.69931494 hartree
electener: -5068.80472668 hartree
oneelecener: -9107.74864827 hartree
twoeener: 4038.94392159 hartree
cpcmener: -0.04158795 hartree
kineticenergy: 1553.61610732 hartree
xcener: -146.816192142511 hartree
chargesum: 0.0000000
charge: -0.206654 -0.213102 -0.278568 -0.439174 -0.290999 -0.327356 -0.099549 0.133206 0.059550 0.011119 -0.297502 -0.309563 0.339610 -0.217780 -0.187833 0.401431 -0.189815 -0.232313 0.280622 -0.001123 -0.202034 -0.213826 0.327754 -0.220733 -0.117652 -0.254771 0.428853 0.313909 -0.209595 -0.246420 -0.136340 -0.142551 -0.177693 0.101257 0.046166 0.094752 0.094300 0.091036 0.098612 0.097101 0.090919 0.142431 0.140357 0.137779 0.156503 0.147411 0.142987 0.138448 0.159693 0.144001 0.095039 0.158770 0.152956 0.162836 0.161973 0.161563
qa: -0.2067 -0.2131 -0.2786 -0.4392 -0.2910 -0.3274 -0.0995 0.1332 0.0596 0.0111 -0.2975 -0.3096 0.3396 -0.2178 -0.1878 0.4014 -0.1898 -0.2323 0.2806 -0.0011 -0.2020 -0.2138 0.3278 -0.2207 -0.1177 -0.2548 0.4289 0.3139 -0.2096 -0.2464 -0.1363 -0.1426 -0.1777 0.1013 0.0462 0.0948 0.0943 0.0910 0.0986 0.0971 0.0909 0.1424 0.1404 0.1378 0.1565 0.1474 0.1430 0.1384 0.1597 0.1440 0.0950 0.1588 0.1530 0.1628 0.1620 0.1616
va: 1.0705 1.0535 2.1288 2.0529 2.0447 2.0526 3.1080 3.6464 3.8150 3.4869 3.9266 3.9459 4.2470 3.9725 3.9613 3.7423 3.8628 3.9546 3.7182 3.6950 3.8708 3.9508 3.5858 4.0732 3.8814 3.9616 4.2243 3.6458 3.9541 3.9600 3.8795 3.9076 3.9006 1.0350 1.0266 1.0124 1.0037 1.0021 1.0013 1.0042 1.0019 1.0167 1.0058 1.0228 1.0033 1.0068 1.0213 1.0098 0.9892 1.0102 1.0014 0.9968 1.0031 0.9884 0.9897 0.9889
dispcorr: -0.037268961 hartree
energy: -1560.142680710011
dipole: 21.20227 -21.67061 -0.46833 -8.81118 8.27185 -0.53932 -20.25617 19.28861 -0.96756
magnitude: 1.20266 au
magnitude: 3.05691 debye
