program: Orca
programVersion: 5.0.2
elementType: F F O O O O N C C C C C C C C C C C C C C C C C C C C C C C C C C H H H H H H H H H H H H H H H H H H H H H H H
charge: 0
multiplicity: 1
keywords: wb97x-d3
keywords: def2-TZVPP
keywords: def2/J RIJCOSX
keywords: DEFGRID2
keywords: scfconv7
keywords: smallprint printgap noloewdin
keywords: NOSOSCF
formula: C26H23F2NO4
InChI: InChI=1/C26H23F2NO4/c1-17(2)24(18-11-13-21(14-12-18)32-26(27)28)25(30)33-23(16-29)19-7-6-10-22(15-19)31-20-8-4-3-5-9-20/h3-15,17,23-24,26H,1-2H3
56 atoms
F  -3.120402 -0.635953 -1.698123
F  -4.423685 -2.086004 -0.763794
O  3.377156 0.407656 0.787797
O  3.962506 -0.250745 -1.269131
O  -2.440615 -1.855736 0.039976
O  -1.613109 1.388367 0.989292
N  3.502901 3.271142 2.416947
C  3.22537 -1.892779 0.351543
C  3.92958 -3.039028 -0.383997
C  1.712053 -1.914299 0.232512
C  5.438198 -2.9754 -0.170943
C  3.390291 -4.37758 0.107121
C  3.604511 -0.52415 -0.154021
C  0.912527 -2.002187 1.367453
C  1.089195 -1.797416 -1.004675
C  3.152901 1.74205 0.329487
C  -0.467697 -1.990602 1.270793
C  -0.293928 -1.770171 -1.121213
C  -1.069374 -1.874355 0.025164
C  1.754817 1.847775 -0.227902
C  0.667502 1.652323 0.615102
C  1.56317 2.038143 -1.588755
C  -0.617272 1.642179 0.092675
C  3.345028 2.589487 1.504924
C  0.272811 2.020346 -2.099034
C  -0.820917 1.812988 -1.273492
C  -3.150091 -1.86167 -1.119954
C  -2.911664 1.779564 0.786483
C  -3.893748 0.916046 1.25344
C  -3.254264 3.002162 0.22322
C  -5.229215 1.267121 1.129749
C  -4.596228 3.335619 0.097264
C  -5.588009 2.472456 0.541923
H  3.48142 -1.952959 1.413926
H  3.719375 -2.953551 -1.454481
H  5.684458 -3.0654 0.889363
H  5.878918 -2.047935 -0.537079
H  5.93203 -3.795446 -0.693657
H  3.53205 -4.485732 1.184954
H  2.327463 -4.498438 -0.102756
H  3.915483 -5.200734 -0.378838
H  1.372283 -2.08412 2.344309
H  1.677849 -1.715254 -1.909779
H  3.893793 2.044339 -0.416333
H  -1.079109 -2.065834 2.160763
H  -0.724989 -1.655093 -2.106097
H  0.80663 1.499896 1.679379
H  2.409237 2.192287 -2.245172
H  0.112705 2.155229 -3.160228
H  -1.813063 1.789054 -1.701779
H  -2.82653 -2.608933 -1.848563
H  -3.614493 -0.019509 1.718982
H  -2.494904 3.694761 -0.115636
H  -5.990709 0.589658 1.492941
H  -4.86273 4.284619 -0.348978
H  -6.630785 2.74039 0.438436
elementType: F O N C H
totalener: -1560.10574072 hartree
nucrepener: 3507.86025316 hartree
electener: -5067.96599388 hartree
oneelecener: -9107.86801626 hartree
twoeener: 4039.90202238 hartree
cpcmener: -0.04289438 hartree
kineticenergy: 1553.63444594 hartree
xcener: -146.821232658060 hartree
chargesum: -0.0000000
charge: -0.211582 -0.206002 -0.282144 -0.438641 -0.297423 -0.326032 -0.098744 0.130097 0.064497 -0.060061 -0.291868 -0.316303 0.338209 -0.137135 -0.220885 0.432468 -0.213167 -0.186495 0.293577 0.067870 -0.336285 -0.199258 0.372451 -0.234941 -0.120147 -0.249034 0.400306 0.330759 -0.281658 -0.223611 -0.125812 -0.148769 -0.186357 0.100234 0.046035 0.089523 0.093469 0.093272 0.091140 0.097778 0.098478 0.140056 0.143432 0.139527 0.146831 0.139063 0.131445 0.147021 0.162363 0.149891 0.159778 0.147578 0.160401 0.160947 0.162687 0.161174
qa: -0.2116 -0.2060 -0.2821 -0.4386 -0.2974 -0.3260 -0.0987 0.1301 0.0645 -0.0601 -0.2919 -0.3163 0.3382 -0.1371 -0.2209 0.4325 -0.2132 -0.1865 0.2936 0.0679 -0.3363 -0.1993 0.3725 -0.2349 -0.1201 -0.2490 0.4003 0.3308 -0.2817 -0.2236 -0.1258 -0.1488 -0.1864 0.1002 0.0460 0.0895 0.0935 0.0933 0.0911 0.0978 0.0985 0.1401 0.1434 0.1395 0.1468 0.1391 0.1314 0.1470 0.1624 0.1499 0.1598 0.1476 0.1604 0.1609 0.1627 0.1612
va: 1.0585 1.0779 2.1461 2.0521 2.0759 2.0440 3.1099 3.6696 3.8061 3.5159 3.9228 3.9519 4.2570 3.9323 3.9696 3.7190 3.9510 3.8916 3.7022 3.5428 4.0886 3.9554 3.5705 4.0884 3.9152 3.9159 4.2043 3.6185 3.9465 3.9169 3.8957 3.8851 3.9051 1.0383 1.0258 1.0017 1.0136 1.0045 1.0016 0.9998 1.0044 1.0025 1.0192 1.0152 1.0039 1.0144 1.0309 1.0082 0.9886 1.0099 0.9695 1.0193 0.9965 0.9896 0.9888 0.9891
dispcorr: -0.037398751 hartree
energy: -1560.143139472885
dipole: 20.89223 -21.23351 -0.34128 -13.43321 11.77262 -1.66059 -1.23329 -0.43325 -1.66654
magnitude: 2.37726 au
magnitude: 6.04252 debye
