program: Orca
programVersion: 5.0.2
elementType: F F O O O O N C C C C C C C C C C C C C C C C C C C C C C C C C C H H H H H H H H H H H H H H H H H H H H H H H
charge: 0
multiplicity: 1
keywords: wb97x-d3
keywords: def2-TZVPP
keywords: def2/J RIJCOSX
keywords: DEFGRID2
keywords: scfconv7
keywords: smallprint printgap noloewdin
keywords: NOSOSCF
formula: C26H23F2NO4
InChI: InChI=1/C26H23F2NO4/c1-17(2)24(18-11-13-21(14-12-18)32-26(27)28)25(30)33-23(16-29)19-7-6-10-22(15-19)31-20-8-4-3-5-9-20/h3-15,17,23-24,26H,1-2H3
56 atoms
F  -3.483281 -3.000239 1.883533
F  -4.725706 -1.565924 0.853708
O  3.340883 0.317965 0.691969
O  3.439346 0.078301 -1.526915
O  -2.74174 -1.906672 0.089509
O  -1.452011 1.661771 0.600188
N  3.969859 2.678011 2.906717
C  2.928052 -1.840057 -0.134893
C  3.516776 -2.830048 -1.150813
C  1.41359 -1.859521 -0.051083
C  5.041409 -2.80515 -1.101544
C  3.006058 -4.238794 -0.872403
C  3.287968 -0.405103 -0.438099
C  0.775134 -2.065522 1.162898
C  0.626438 -1.647026 -1.181802
C  3.38597 1.729175 0.544104
C  -0.61092 -2.084011 1.26537
C  -0.753162 -1.661837 -1.099663
C  -1.373365 -1.880806 0.124427
C  2.063457 2.293244 0.074115
C  0.877282 1.733928 0.528671
C  2.045607 3.364682 -0.806424
C  -0.333937 2.248892 0.090307
C  3.714223 2.24401 1.874602
C  0.827018 3.887514 -1.213199
C  -0.367572 3.340503 -0.770566
C  -3.464216 -1.80849 1.235287
C  -2.615465 1.605859 -0.119221
C  -2.639541 1.293408 -1.473187
C  -3.795258 1.804199 0.583407
C  -3.862425 1.18329 -2.118947
C  -5.010959 1.681246 -0.073833
C  -5.050678 1.374927 -1.426675
H  3.323338 -2.088835 0.854803
H  3.196004 -2.539052 -2.15575
H  5.405673 -3.094347 -0.112837
H  5.456615 -1.823448 -1.333619
H  5.459641 -3.508341 -1.823337
H  1.924082 -4.318766 -0.981051
H  3.455326 -4.950723 -1.5665
H  3.263363 -4.55976 0.140223
H  1.362952 -2.228242 2.057998
H  1.084833 -1.47152 -2.147117
H  4.189629 2.035794 -0.133994
H  -1.054492 -2.274204 2.233224
H  -1.355793 -1.508696 -1.985753
H  0.874282 0.900027 1.220517
H  2.972894 3.789136 -1.169771
H  0.803596 4.732105 -1.889179
H  -1.307777 3.765791 -1.097034
H  -3.120904 -1.032214 1.924415
H  -1.721319 1.13055 -2.023081
H  -3.759276 2.044977 1.638721
H  -3.882291 0.93883 -3.173274
H  -5.929886 1.83215 0.477776
H  -5.999705 1.282417 -1.938238
elementType: F O N C H
totalener: -1560.12060851 hartree
nucrepener: 3476.87781195 hartree
electener: -5036.99842045 hartree
oneelecener: -9045.05164622 hartree
twoeener: 4008.05322577 hartree
cpcmener: -0.03771661 hartree
kineticenergy: 1553.64401331 hartree
xcener: -146.820294221906 hartree
chargesum: -0.0000000
charge: -0.210387 -0.194955 -0.276271 -0.415797 -0.269749 -0.323701 -0.085721 0.134727 0.061897 -0.028966 -0.293239 -0.310458 0.314763 -0.231982 -0.157721 0.384402 -0.123259 -0.222866 0.247967 0.044937 -0.271305 -0.199950 0.269860 -0.230617 -0.126946 -0.196650 0.377253 0.355243 -0.237924 -0.278627 -0.134381 -0.123012 -0.176484 0.095834 0.046468 0.088817 0.095415 0.093592 0.098125 0.097766 0.089731 0.137337 0.140197 0.144771 0.138588 0.147891 0.154597 0.143309 0.160182 0.157047 0.128875 0.156889 0.143163 0.158437 0.155783 0.157103
qa: -0.2104 -0.1950 -0.2763 -0.4158 -0.2697 -0.3237 -0.0857 0.1347 0.0619 -0.0290 -0.2932 -0.3105 0.3148 -0.2320 -0.1577 0.3844 -0.1233 -0.2229 0.2480 0.0449 -0.2713 -0.2000 0.2699 -0.2306 -0.1269 -0.1966 0.3773 0.3552 -0.2379 -0.2786 -0.1344 -0.1230 -0.1765 0.0958 0.0465 0.0888 0.0954 0.0936 0.0981 0.0978 0.0897 0.1373 0.1402 0.1448 0.1386 0.1479 0.1546 0.1433 0.1602 0.1570 0.1289 0.1569 0.1432 0.1584 0.1558 0.1571
va: 1.0576 1.0756 2.1408 2.0827 2.0502 2.0435 3.1127 3.6777 3.8071 3.4722 3.9269 3.9493 4.2542 4.0212 3.9492 3.7427 3.8816 3.9784 3.7806 3.6238 4.0294 3.9877 3.7866 4.0811 3.8998 3.9248 4.2517 3.4839 3.8941 3.9851 3.9085 3.8525 3.9119 1.0383 1.0264 1.0024 1.0120 1.0043 1.0006 1.0047 1.0021 1.0072 1.0163 1.0147 1.0155 1.0026 1.0091 1.0022 0.9903 0.9958 0.9736 0.9973 1.0101 0.9902 0.9893 0.9900
dispcorr: -0.036375010 hartree
energy: -1560.156983517893
dipole: 21.42760 -21.43220 -0.00460 -7.72682 7.61266 -0.11416 -14.64306 13.46703 -1.17603
magnitude: 1.18156 au
magnitude: 3.00329 debye
