program: Orca
programVersion: 5.0.2
elementType: F F O O O O N C C C C C C C C C C C C C C C C C C C C C C C C C C H H H H H H H H H H H H H H H H H H H H H H H
charge: 0
multiplicity: 1
keywords: wb97x-d3
keywords: def2-TZVPP
keywords: def2/J RIJCOSX
keywords: DEFGRID2
keywords: scfconv7
keywords: smallprint printgap noloewdin
keywords: NOSOSCF
formula: C26H23F2NO4
InChI: InChI=1/C26H23F2NO4/c1-17(2)24(18-11-13-21(14-12-18)32-26(27)28)25(30)33-23(16-29)19-7-6-10-22(15-19)31-20-8-4-3-5-9-20/h3-15,17,23-24,26H,1-2H3
56 atoms
F  -3.605764 -3.135291 1.438701
F  -4.78905 -1.686755 0.356896
O  3.392523 0.389055 0.687207
O  3.545132 -0.053495 -1.497262
O  -2.736072 -1.960202 -0.239387
O  -1.384756 1.667379 0.707459
N  4.112706 2.932729 2.662777
C  2.930341 -1.821432 0.039995
C  3.575297 -2.921136 -0.817491
C  1.414031 -1.82641 -0.0063
C  5.092774 -2.901663 -0.666622
C  3.026283 -4.285616 -0.417766
C  3.347819 -0.431713 -0.374353
C  0.727031 -1.642483 -1.205305
C  0.672411 -2.0240 1.149044
C  3.433815 1.782289 0.417377
C  -0.65414 -1.678149 -1.246005
C  -0.716929 -2.07029 1.127524
C  -1.377579 -1.900066 -0.080281
C  2.086353 2.299749 -0.034763
C  0.930452 1.759359 0.51004
C  2.01519 3.313662 -0.978777
C  -0.306988 2.23566 0.101588
C  3.817502 2.40973 1.683535
C  0.771857 3.798842 -1.356548
C  -0.394084 3.271761 -0.822037
C  -3.55955 -1.919251 0.838957
C  -2.616198 1.641401 0.110787
C  -2.789293 1.309359 -1.227295
C  -3.710738 1.892648 0.925966
C  -4.074328 1.243679 -1.745802
C  -4.99066 1.812383 0.395804
C  -5.178218 1.495528 -0.942114
H  3.235917 -1.975244 1.079243
H  3.324466 -2.741562 -1.867471
H  5.548609 -3.684689 -1.274539
H  5.385215 -3.080037 0.370963
H  5.537522 -1.955383 -0.978677
H  3.207998 -4.490661 0.640282
H  1.953273 -4.370093 -0.592187
H  3.51183 -5.075106 -0.993343
H  1.266613 -1.4752 -2.129111
H  1.180301 -2.163896 2.095531
H  4.204006 2.029208 -0.320596
H  -1.176775 -1.545249 -2.184796
H  -1.239653 -2.258235 2.055606
H  0.970899 0.972608 1.253419
H  2.918724 3.722831 -1.412613
H  0.704783 4.59926 -2.081593
H  -1.351855 3.672073 -1.127613
H  -3.298543 -1.16343 1.58376
H  -1.938623 1.099844 -1.86317
H  -3.559141 2.144857 1.968247
H  -4.209889 0.986594 -2.78843
H  -5.842691 2.006295 1.03447
H  -6.176882 1.438502 -1.354482
elementType: F O N C H
totalener: -1560.12046338 hartree
nucrepener: 3470.78061227 hartree
electener: -5030.90107566 hartree
oneelecener: -9032.77040049 hartree
twoeener: 4001.86932483 hartree
cpcmener: -0.03726641 hartree
kineticenergy: 1553.64225457 hartree
xcener: -146.819822923361 hartree
chargesum: -0.0000000
charge: -0.210878 -0.195372 -0.279377 -0.418334 -0.268900 -0.321319 -0.086087 0.140820 0.063151 -0.056609 -0.291733 -0.313228 0.318395 -0.135085 -0.215305 0.388647 -0.244594 -0.134505 0.264226 0.052889 -0.273107 -0.204601 0.279284 -0.231468 -0.128090 -0.202859 0.382359 0.381053 -0.260895 -0.306485 -0.111473 -0.085028 -0.208605 0.091778 0.046973 0.093559 0.089147 0.094785 0.089631 0.098206 0.098323 0.140056 0.138176 0.144841 0.146822 0.137438 0.148525 0.143992 0.159943 0.157449 0.124291 0.155786 0.143448 0.157411 0.156648 0.155886
qa: -0.2109 -0.1954 -0.2794 -0.4183 -0.2689 -0.3213 -0.0861 0.1408 0.0632 -0.0566 -0.2917 -0.3132 0.3184 -0.1351 -0.2153 0.3886 -0.2446 -0.1345 0.2642 0.0529 -0.2731 -0.2046 0.2793 -0.2315 -0.1281 -0.2029 0.3824 0.3811 -0.2609 -0.3065 -0.1115 -0.0850 -0.2086 0.0918 0.0470 0.0936 0.0891 0.0948 0.0896 0.0982 0.0983 0.1401 0.1382 0.1448 0.1468 0.1374 0.1485 0.1440 0.1599 0.1574 0.1243 0.1558 0.1434 0.1574 0.1566 0.1559
va: 1.0591 1.0755 2.1352 2.0789 2.0481 2.0486 3.1130 3.6829 3.8052 3.5039 3.9256 3.9521 4.2471 3.9301 3.9862 3.7345 3.9916 3.8908 3.7553 3.6278 4.0315 3.9933 3.7700 4.0807 3.9022 3.9242 4.2598 3.4590 3.8983 4.0181 3.8825 3.8320 3.9232 1.0412 1.0261 1.0044 1.0023 1.0119 1.0021 1.0000 1.0048 1.0184 1.0060 1.0164 1.0053 1.0153 1.0163 1.0021 0.9903 0.9956 0.9720 0.9976 1.0105 0.9901 0.9886 0.9914
dispcorr: -0.036276792 hartree
energy: -1560.156740173792
dipole: 21.15989 -21.41237 -0.25248 -7.77677 7.58531 -0.19146 -10.05660 9.12339 -0.93321
magnitude: 0.98554 au
magnitude: 2.50504 debye
