program: Orca
programVersion: 5.0.2
elementType: F F O O O O N C C C C C C C C C C C C C C C C C C C C C C C C C C H H H H H H H H H H H H H H H H H H H H H H H
charge: 0
multiplicity: 1
keywords: wb97x-d3
keywords: def2-TZVPP
keywords: def2/J RIJCOSX
keywords: DEFGRID2
keywords: scfconv7
keywords: smallprint printgap noloewdin
keywords: NOSOSCF
formula: C26H23F2NO4
InChI: InChI=1/C26H23F2NO4/c1-17(2)24(18-11-13-21(14-12-18)32-26(27)28)25(30)33-23(16-29)19-7-6-10-22(15-19)31-20-8-4-3-5-9-20/h3-15,17,23-24,26H,1-2H3
56 atoms
F  -3.742642 -2.481778 -1.465859
F  -4.22787 -3.827206 0.153014
O  3.282463 0.469628 0.808168
O  3.512947 -0.050216 -1.350854
O  -2.582473 -2.438292 0.43489
O  -1.549414 1.391412 0.17635
N  3.673846 3.151399 2.695272
C  3.056124 -1.803912 0.25655
C  3.75534 -2.867638 -0.605025
C  1.545682 -1.942675 0.285709
C  5.270812 -2.710267 -0.536336
C  3.354568 -4.264298 -0.144221
C  3.335266 -0.397289 -0.214854
C  0.79433 -1.849655 -0.882015
C  0.878731 -2.16371 1.485641
C  3.258785 1.84834 0.470177
C  -0.584217 -2.00003 -0.86325
C  -0.497203 -2.328475 1.520446
C  -1.221568 -2.259088 0.341619
C  1.939042 2.260521 -0.142144
C  0.759295 1.692638 0.318993
C  1.917796 3.209844 -1.153097
C  -0.445471 2.054851 -0.264872
C  3.488844 2.559432 1.729192
C  0.702449 3.580051 -1.710041
C  -0.482946 3.002397 -1.282339
C  -3.1972 -3.234865 -0.477406
C  -2.775129 2.001737 0.188047
C  -2.950139 3.286756 0.687445
C  -3.857445 1.258569 -0.258904
C  -4.226424 3.828685 0.724575
C  -5.129927 1.809957 -0.204719
C  -5.319795 3.096419 0.280214
H  3.422026 -1.899788 1.283531
H  3.435638 -2.742655 -1.64416
H  5.629791 -2.826855 0.489005
H  5.613312 -1.741218 -0.900813
H  5.762141 -3.471884 -1.143693
H  2.285971 -4.449456 -0.256105
H  3.878032 -5.022038 -0.729314
H  3.6123 -4.423825 0.905769
H  1.277551 -1.656669 -1.831756
H  1.439791 -2.228212 2.409843
H  4.083345 2.107862 -0.202477
H  -1.139979 -1.904984 -1.78728
H  -1.003882 -2.519396 2.457957
H  0.758266 0.961097 1.118385
H  2.840712 3.649301 -1.510072
H  0.676444 4.314678 -2.504155
H  -1.417708 3.28505 -1.749058
H  -2.548552 -3.991767 -0.925611
H  -2.106178 3.860551 1.050114
H  -3.705849 0.255309 -0.637347
H  -4.364469 4.829415 1.113535
H  -5.975016 1.228979 -0.550797
H  -6.312828 3.524645 0.317266
elementType: F O N C H
totalener: -1560.12031988 hartree
nucrepener: 3388.70917447 hartree
electener: -4948.82949435 hartree
oneelecener: -8869.05634771 hartree
twoeener: 3920.22685336 hartree
cpcmener: -0.03762107 hartree
kineticenergy: 1553.63429242 hartree
xcener: -146.813916717627 hartree
chargesum: -0.0000000
charge: -0.211148 -0.201558 -0.277933 -0.415919 -0.298767 -0.318927 -0.084873 0.148355 0.060936 -0.054941 -0.290996 -0.313804 0.319182 -0.149890 -0.181088 0.384884 -0.192014 -0.173402 0.227001 0.065904 -0.279033 -0.206568 0.276167 -0.231135 -0.118358 -0.203437 0.393441 0.271122 -0.189835 -0.221832 -0.147615 -0.143694 -0.171292 0.093775 0.047482 0.089474 0.094400 0.093029 0.097385 0.098693 0.090297 0.141271 0.136606 0.145888 0.149555 0.149469 0.144615 0.143166 0.160015 0.158526 0.130253 0.157271 0.137610 0.158600 0.156294 0.157391
qa: -0.2111 -0.2016 -0.2779 -0.4159 -0.2988 -0.3189 -0.0849 0.1484 0.0609 -0.0549 -0.2910 -0.3138 0.3192 -0.1499 -0.1811 0.3849 -0.1920 -0.1734 0.2270 0.0659 -0.2790 -0.2066 0.2762 -0.2311 -0.1184 -0.2034 0.3934 0.2711 -0.1898 -0.2218 -0.1476 -0.1437 -0.1713 0.0938 0.0475 0.0895 0.0944 0.0930 0.0974 0.0987 0.0903 0.1413 0.1366 0.1459 0.1496 0.1495 0.1446 0.1432 0.1600 0.1585 0.1303 0.1573 0.1376 0.1586 0.1563 0.1574
va: 1.0502 1.0738 2.1424 2.0826 2.0190 2.0590 3.1132 3.6742 3.8085 3.4687 3.9247 3.9523 4.2443 3.9146 3.9692 3.7360 3.9414 4.0351 3.7471 3.5775 4.0453 3.9920 3.7364 4.0823 3.9010 3.9529 4.2410 3.7009 3.9260 3.9655 3.8972 3.9113 3.8959 1.0397 1.0263 1.0021 1.0130 1.0045 1.0002 1.0046 1.0020 1.0198 1.0047 1.0140 1.0116 1.0026 1.0148 1.0025 0.9900 0.9950 0.9777 0.9964 1.0205 0.9902 0.9912 0.9901
dispcorr: -0.033082220 hartree
energy: -1560.153402102598
dipole: 22.61421 -22.19585 0.41836 -4.13514 3.21796 -0.91718 -3.81325 2.58833 -1.22492
magnitude: 1.58640 au
magnitude: 4.03232 debye
